null
SMILES: CC(F)(F)COc1cc(F)c([C@H]2COC(=O)N2c2ccc3[nH]cnc3c2)c(F)c1
InChI Key:
Activity Spreadsheet -- Enzyme Inhibition Constant Data from BindingDB
Found 2 hits for monomerid = 259913
Trg + Lig
Ki
nM
ΔG°
kcal/mole
IC50
nM
Kd
nM
EC50/IC50
nM
koff
s-1
kon
M-1s-1
pHTemp
°C
Glutaminyl-peptide cyclotransferase
(Homo sapiens (Human))
BDBM259913
(US9512115, 17)
Show SMILES CC(F)(F)COc1cc(F)c([C@H]2COC(=O)N2c2ccc3[nH]cnc3c2)c(F)c1 |r|
US Patent
6.66 -11.3n/an/an/an/an/a6.030
PROBIODRUG AG
US Patent
Assay Description
All measurements were performed with a BioAssay Reader HTS-7000Plus for microplates (Perkin Elmer) at 30° C. QC activity was evaluated fluorometr...
US Patent US9512115 (2016)
BindingDB Entry DOI: 10.7270/Q2XK8DG4
Glutaminyl-peptide cyclotransferase
(Homo sapiens (Human))
BDBM259913
(US9512115, 17)
Show SMILES CC(F)(F)COc1cc(F)c([C@H]2COC(=O)N2c2ccc3[nH]cnc3c2)c(F)c1 |r|
US Patent
8.29 -11.2n/an/an/an/an/a8.030
PROBIODRUG AG
US Patent
Assay Description
All measurements were performed with a BioAssay Reader HTS-7000Plus for microplates (Perkin Elmer) at 30° C. QC activity was evaluated fluorometr...
US Patent US9512115 (2016)
BindingDB Entry DOI: 10.7270/Q2XK8DG4