BDBM260156 US9522910, Table 1 Compound 6: 3-{2-[2-methyl-5-({4-[(4-methylpiperazin-1-yl)methyl]-3-(trifluoromethyl)phenyl}carbamoyl)phenyl]ethynyl}-[1,2,4]triazolo[4,3-b]pyridazine-7-carboxylic acid
SMILES: CN1CCN(Cc2ccc(NC(=O)c3ccc(C)c(c3)C#Cc3nnc4cc(cnn34)C(O)=O)cc2C(F)(F)F)CC1
InChI Key: InChIKey=ZLRZHPRODQMFFR-UHFFFAOYSA-N
Data: 2 IC50
Activity Spreadsheet -- Enzyme Inhibition Constant Data from BindingDB
Found 2 hits for monomerid = 260156
Trg + Lig
Ki
nM
ΔG°
kcal/mole
IC50
nM
Kd
nM
EC50/IC50
nM
koff
s-1
kon
M-1s-1
pHTemp
°C
ABL Mutant (T315I)
(Homo sapiens (Human))
BDBM260156
(US9522910, Table 1 Compound 6: 3-{2-[2-methyl-5-({...)
Show SMILES CN1CCN(Cc2ccc(NC(=O)c3ccc(C)c(c3)C#Cc3nnc4cc(cnn34)C(O)=O)cc2C(F)(F)F)CC1
Show InChI InChI=1S/C29H26F3N7O3/c1-18-3-4-20(13-19(18)6-8-25-35-36-26-14-22(28(41)42)16-33-39(25)26)27(40)34-23-7-5-21(24(15-23)29(30,31)32)17-38-11-9-37(2)10-12-38/h3-5,7,13-16H,9-12,17H2,1-2H3,(H,34,40)(H,41,42)
US Patent
n/an/a<20n/an/an/an/an/an/a
OBSHCHESTVO S OGRANICHENNOY OTVETSTVENNOSTYOU “FUSION PHARMA”
US Patent
Assay Description
Kinase activity and inhibition was measured by established protocols (see e.g. Braunwalder et al., A Solid-Phase Assay for the Determination of Prote...
US Patent US9522910 (2016)
BindingDB Entry DOI: 10.7270/Q2542MHG
Tyrosine-protein kinase ABL1
(Homo sapiens (Human))
BDBM260156
(US9522910, Table 1 Compound 6: 3-{2-[2-methyl-5-({...)
Show SMILES CN1CCN(Cc2ccc(NC(=O)c3ccc(C)c(c3)C#Cc3nnc4cc(cnn34)C(O)=O)cc2C(F)(F)F)CC1
Show InChI InChI=1S/C29H26F3N7O3/c1-18-3-4-20(13-19(18)6-8-25-35-36-26-14-22(28(41)42)16-33-39(25)26)27(40)34-23-7-5-21(24(15-23)29(30,31)32)17-38-11-9-37(2)10-12-38/h3-5,7,13-16H,9-12,17H2,1-2H3,(H,34,40)(H,41,42)
Reactome pathway
US Patent
n/an/a<20n/an/an/an/an/an/a
OBSHCHESTVO S OGRANICHENNOY OTVETSTVENNOSTYOU “FUSION PHARMA”
US Patent
Assay Description
Kinase activity and inhibition was measured by established protocols (see e.g. Braunwalder et al., A Solid-Phase Assay for the Determination of Prote...
US Patent US9522910 (2016)
BindingDB Entry DOI: 10.7270/Q2542MHG