BDBM26034 4-({2-[(4-bromophenyl)amino]-1-methyl-1H-1,3-benzodiazol-5-yl}oxy)pyridine-2-carboxamide::arylaminobenzimidazole, 29
SMILES: Cn1c(Nc2ccc(Br)cc2)nc2cc(Oc3ccnc(c3)C(N)=O)ccc12
InChI Key: InChIKey=NOAPEINCMDCENK-UHFFFAOYSA-N
Data: 1 IC50
Activity Spreadsheet -- Enzyme Inhibition Constant Data from BindingDB
Found 1 hit for monomerid = 26034
Trg + Lig
Ki
nM
ΔG°
kcal/mole
IC50
nM
Kd
nM
EC50/IC50
nM
koff
s-1
kon
M-1s-1
pHTemp
°C
RAF proto-oncogene serine/threonine-protein kinase
(Homo sapiens (Human))
BDBM26034
(4-({2-[(4-bromophenyl)amino]-1-methyl-1H-1,3-benzo...)
Show SMILES Cn1c(Nc2ccc(Br)cc2)nc2cc(Oc3ccnc(c3)C(N)=O)ccc12
Show InChI InChI=1S/C20H16BrN5O2/c1-26-18-7-6-14(28-15-8-9-23-17(11-15)19(22)27)10-16(18)25-20(26)24-13-4-2-12(21)3-5-13/h2-11H,1H3,(H2,22,27)(H,24,25)
NCI pathway
Reactome pathway
n/an/a 1n/an/an/an/an/an/a
Novartis
Assay Description
To measure compound inhibitor effects on the ability of Raf enzymes to phosphorylate the Mek substrate, a capture ELISA utilizing streptavidin-coated...
J Med Chem 51: 7049-52 (2008)
Article DOI: 10.1021/jm801050k
BindingDB Entry DOI: 10.7270/Q2B56H1C