BDBM26037 4-({2-[(4-bromophenyl)amino]-1-methyl-1H-1,3-benzodiazol-5-yl}oxy)-N-(2-hydroxyethyl)pyridine-2-carboxamide::arylaminobenzimidazole, 32
SMILES: Cn1c(Nc2ccc(Br)cc2)nc2cc(Oc3ccnc(c3)C(=O)NCCO)ccc12
InChI Key: InChIKey=DMCSEJJVWUBBBX-UHFFFAOYSA-N
Data: 2 IC50
Activity Spreadsheet -- Enzyme Inhibition Constant Data from BindingDB
Found 2 hits for monomerid = 26037
Trg + Lig
Ki
nM
ΔG°
kcal/mole
IC50
nM
Kd
nM
EC50/IC50
nM
koff
s-1
kon
M-1s-1
pHTemp
°C
B-RAF V600E
(Homo sapiens (Human))
BDBM26037
(4-({2-[(4-bromophenyl)amino]-1-methyl-1H-1,3-benzo...)
Show SMILES Cn1c(Nc2ccc(Br)cc2)nc2cc(Oc3ccnc(c3)C(=O)NCCO)ccc12
Show InChI InChI=1S/C22H20BrN5O3/c1-28-20-7-6-16(31-17-8-9-24-19(13-17)21(30)25-10-11-29)12-18(20)27-22(28)26-15-4-2-14(23)3-5-15/h2-9,12-13,29H,10-11H2,1H3,(H,25,30)(H,26,27)
n/an/a 11n/an/an/an/an/an/a
Novartis
Assay Description
To measure compound inhibitor effects on the ability of Raf enzymes to phosphorylate the Mek substrate, a capture ELISA utilizing streptavidin-coated...
J Med Chem 51: 7049-52 (2008)
Article DOI: 10.1021/jm801050k
BindingDB Entry DOI: 10.7270/Q2B56H1C
RAF proto-oncogene serine/threonine-protein kinase
(Homo sapiens (Human))
BDBM26037
(4-({2-[(4-bromophenyl)amino]-1-methyl-1H-1,3-benzo...)
Show SMILES Cn1c(Nc2ccc(Br)cc2)nc2cc(Oc3ccnc(c3)C(=O)NCCO)ccc12
Show InChI InChI=1S/C22H20BrN5O3/c1-28-20-7-6-16(31-17-8-9-24-19(13-17)21(30)25-10-11-29)12-18(20)27-22(28)26-15-4-2-14(23)3-5-15/h2-9,12-13,29H,10-11H2,1H3,(H,25,30)(H,26,27)
NCI pathway
Reactome pathway
n/an/a 4n/an/an/an/an/an/a
Novartis
Assay Description
To measure compound inhibitor effects on the ability of Raf enzymes to phosphorylate the Mek substrate, a capture ELISA utilizing streptavidin-coated...
J Med Chem 51: 7049-52 (2008)
Article DOI: 10.1021/jm801050k
BindingDB Entry DOI: 10.7270/Q2B56H1C