BDBM26038 4-({2-[(4-bromophenyl)amino]-1-methyl-1H-1,3-benzodiazol-5-yl}oxy)-N-(2-propylpiperidin-1-yl)pyridine-2-carboxamide::arylaminobenzimidazole, 33
SMILES: CCCC1CCCCN1NC(=O)c1cc(Oc2ccc3n(C)c(Nc4ccc(Br)cc4)nc3c2)ccn1
InChI Key: InChIKey=QCJKEFGMBJFTRC-UHFFFAOYSA-N
Data: 2 IC50
Activity Spreadsheet -- Enzyme Inhibition Constant Data from BindingDB
Found 2 hits for monomerid = 26038
Trg + Lig
Ki
nM
ΔG°
kcal/mole
IC50
nM
Kd
nM
EC50/IC50
nM
koff
s-1
kon
M-1s-1
pHTemp
°C
B-RAF V600E
(Homo sapiens (Human))
BDBM26038
(4-({2-[(4-bromophenyl)amino]-1-methyl-1H-1,3-benzo...)
Show SMILES CCCC1CCCCN1NC(=O)c1cc(Oc2ccc3n(C)c(Nc4ccc(Br)cc4)nc3c2)ccn1
Show InChI InChI=1S/C28H31BrN6O2/c1-3-6-21-7-4-5-16-35(21)33-27(36)25-18-23(14-15-30-25)37-22-12-13-26-24(17-22)32-28(34(26)2)31-20-10-8-19(29)9-11-20/h8-15,17-18,21H,3-7,16H2,1-2H3,(H,31,32)(H,33,36)
n/an/a 7n/an/an/an/an/an/a
Novartis
Assay Description
To measure compound inhibitor effects on the ability of Raf enzymes to phosphorylate the Mek substrate, a capture ELISA utilizing streptavidin-coated...
J Med Chem 51: 7049-52 (2008)
Article DOI: 10.1021/jm801050k
BindingDB Entry DOI: 10.7270/Q2B56H1C
RAF proto-oncogene serine/threonine-protein kinase
(Homo sapiens (Human))
BDBM26038
(4-({2-[(4-bromophenyl)amino]-1-methyl-1H-1,3-benzo...)
Show SMILES CCCC1CCCCN1NC(=O)c1cc(Oc2ccc3n(C)c(Nc4ccc(Br)cc4)nc3c2)ccn1
Show InChI InChI=1S/C28H31BrN6O2/c1-3-6-21-7-4-5-16-35(21)33-27(36)25-18-23(14-15-30-25)37-22-12-13-26-24(17-22)32-28(34(26)2)31-20-10-8-19(29)9-11-20/h8-15,17-18,21H,3-7,16H2,1-2H3,(H,31,32)(H,33,36)
NCI pathway
Reactome pathway
n/an/a 41n/an/an/an/an/an/a
Novartis
Assay Description
To measure compound inhibitor effects on the ability of Raf enzymes to phosphorylate the Mek substrate, a capture ELISA utilizing streptavidin-coated...
J Med Chem 51: 7049-52 (2008)
Article DOI: 10.1021/jm801050k
BindingDB Entry DOI: 10.7270/Q2B56H1C