BDBM260475 US10428074, Example 147::US9527851, 147::US9527851, 40::US9527851, example 147
SMILES: CN([C@H]1C[C@H]2CNC(=O)C[C@H]2C1)c1ncnc2[nH]ccc12
InChI Key:
Data: 18 IC50
Activity Spreadsheet -- Enzyme Inhibition Constant Data from BindingDB
Found 18 hits for monomerid = 260475
Trg + Lig
Ki
nM
ΔG°
kcal/mole
IC50
nM
Kd
nM
EC50/IC50
nM
koff
s-1
kon
M-1s-1
pHTemp
°C
Tyrosine-protein kinase JAK1
(Homo sapiens (Human))
BDBM260475
(US10428074, Example 147 | US9527851, 147 | US95278...)
Show SMILES CN([C@H]1C[C@H]2CNC(=O)C[C@H]2C1)c1ncnc2[nH]ccc12 |r|
Reactome pathway
US Patent
n/an/a 98n/an/an/an/a7.327
Jiangsu Hengrui Medicine Co., Ltd.; Shanghai Hengrui Pharmaceutical Co., Ltd.
US Patent
Assay Description
In vitro kinase assays described below can be used to determine the activity of a test compound for inhibiting the activity of JAK1 kinase. The test ...
US Patent US9527851 (2016)
BindingDB Entry DOI: 10.7270/Q2HD7TM2
Tyrosine-protein kinase JAK3
(Homo sapiens (Human))
BDBM260475
(US10428074, Example 147 | US9527851, 147 | US95278...)
Show SMILES CN([C@H]1C[C@H]2CNC(=O)C[C@H]2C1)c1ncnc2[nH]ccc12 |r|
Reactome pathway
US Patent
n/an/a 31n/an/an/an/an/an/a
Jiangsu Hengrui Medicine Co., Ltd.
US Patent
Assay Description
JAK3: In vitro kinase assays described below can be used to determine the activity of a test compound for inhibiting the activity of JAK3 kinase. The...
US Patent US10428074 (2019)
BindingDB Entry DOI: 10.7270/Q26D5WC6
Tyrosine-protein kinase JAK2
(Homo sapiens (Human))
BDBM260475
(US10428074, Example 147 | US9527851, 147 | US95278...)
Show SMILES CN([C@H]1C[C@H]2CNC(=O)C[C@H]2C1)c1ncnc2[nH]ccc12 |r|
Reactome pathway
US Patent
n/an/a 23n/an/an/an/a7.327
Jiangsu Hengrui Medicine Co., Ltd.; Shanghai Hengrui Pharmaceutical Co., Ltd.
US Patent
Assay Description
In vitro kinase assays described below can be used to determine the activity of a test compound for inhibiting the activity of JAK2 kinase. The test ...
US Patent US9527851 (2016)
BindingDB Entry DOI: 10.7270/Q2HD7TM2
Tyrosine-protein kinase JAK2
(Homo sapiens (Human))
BDBM260475
(US10428074, Example 147 | US9527851, 147 | US95278...)
Show SMILES CN([C@H]1C[C@H]2CNC(=O)C[C@H]2C1)c1ncnc2[nH]ccc12 |r|
Reactome pathway
US Patent
n/an/a 5n/an/an/an/a7.327
Jiangsu Hengrui Medicine Co., Ltd.; Shanghai Hengrui Pharmaceutical Co., Ltd.
US Patent
Assay Description
In vitro kinase assays described below can be used to determine the activity of a test compound for inhibiting the activity of JAK2 kinase. The test ...
US Patent US9527851 (2016)
BindingDB Entry DOI: 10.7270/Q2HD7TM2
Tyrosine-protein kinase JAK3
(Homo sapiens (Human))
BDBM260475
(US10428074, Example 147 | US9527851, 147 | US95278...)
Show SMILES CN([C@H]1C[C@H]2CNC(=O)C[C@H]2C1)c1ncnc2[nH]ccc12 |r|
Reactome pathway
US Patent
n/an/a 71n/an/an/an/a7.327
Jiangsu Hengrui Medicine Co., Ltd.; Shanghai Hengrui Pharmaceutical Co., Ltd.
US Patent
Assay Description
In vitro kinase assays described below can be used to determine the activity of a test compound for inhibiting the activity of JAK3 kinase. The test ...
US Patent US9527851 (2016)
BindingDB Entry DOI: 10.7270/Q2HD7TM2
Tyrosine-protein kinase JAK3
(Homo sapiens (Human))
BDBM260475
(US10428074, Example 147 | US9527851, 147 | US95278...)
Show SMILES CN([C@H]1C[C@H]2CNC(=O)C[C@H]2C1)c1ncnc2[nH]ccc12 |r|
Reactome pathway
US Patent
n/an/a 31n/an/an/an/a7.327
Jiangsu Hengrui Medicine Co., Ltd.; Shanghai Hengrui Pharmaceutical Co., Ltd.
US Patent
Assay Description
In vitro kinase assays described below can be used to determine the activity of a test compound for inhibiting the activity of JAK3 kinase. The test ...
US Patent US9527851 (2016)
BindingDB Entry DOI: 10.7270/Q2HD7TM2
Tyrosine-protein kinase JAK1
(Homo sapiens (Human))
BDBM260475
(US10428074, Example 147 | US9527851, 147 | US95278...)
Show SMILES CN([C@H]1C[C@H]2CNC(=O)C[C@H]2C1)c1ncnc2[nH]ccc12 |r|
Reactome pathway
US Patent
n/an/a 98n/an/an/an/a7.325
Jiangsu Hengrui Medicine Co., Ltd.; Shanghai Hengrui Pharmaceutical Co., Ltd.
US Patent
Assay Description
TBDIn vitro kinase assays described below can be used to determine the activity of a test compound for inhibiting the activity of JAK1 kinase. The te...
US Patent US9527851 (2016)
BindingDB Entry DOI: 10.7270/Q2D21VRM
Tyrosine-protein kinase JAK1
(Homo sapiens (Human))
BDBM260475
(US10428074, Example 147 | US9527851, 147 | US95278...)
Show SMILES CN([C@H]1C[C@H]2CNC(=O)C[C@H]2C1)c1ncnc2[nH]ccc12 |r|
Reactome pathway
US Patent
n/an/a 1n/an/an/an/a7.325
Jiangsu Hengrui Medicine Co., Ltd.; Shanghai Hengrui Pharmaceutical Co., Ltd.
US Patent
Assay Description
TBDIn vitro kinase assays described below can be used to determine the activity of a test compound for inhibiting the activity of JAK1 kinase. The te...
US Patent US9527851 (2016)
BindingDB Entry DOI: 10.7270/Q2D21VRM
Tyrosine-protein kinase JAK2
(Homo sapiens (Human))
BDBM260475
(US10428074, Example 147 | US9527851, 147 | US95278...)
Show SMILES CN([C@H]1C[C@H]2CNC(=O)C[C@H]2C1)c1ncnc2[nH]ccc12 |r|
Reactome pathway
US Patent
n/an/a 23n/an/an/an/a7.325
Jiangsu Hengrui Medicine Co., Ltd.; Shanghai Hengrui Pharmaceutical Co., Ltd.
US Patent
Assay Description
In vitro kinase assays described below can be used to determine the activity of a test compound for inhibiting the activity of JAK2 kinase. The test ...
US Patent US9527851 (2016)
BindingDB Entry DOI: 10.7270/Q2D21VRM
Tyrosine-protein kinase JAK2
(Homo sapiens (Human))
BDBM260475
(US10428074, Example 147 | US9527851, 147 | US95278...)
Show SMILES CN([C@H]1C[C@H]2CNC(=O)C[C@H]2C1)c1ncnc2[nH]ccc12 |r|
Reactome pathway
US Patent
n/an/a 5n/an/an/an/a7.325
Jiangsu Hengrui Medicine Co., Ltd.; Shanghai Hengrui Pharmaceutical Co., Ltd.
US Patent
Assay Description
In vitro kinase assays described below can be used to determine the activity of a test compound for inhibiting the activity of JAK2 kinase. The test ...
US Patent US9527851 (2016)
BindingDB Entry DOI: 10.7270/Q2D21VRM
Tyrosine-protein kinase JAK3
(Homo sapiens (Human))
BDBM260475
(US10428074, Example 147 | US9527851, 147 | US95278...)
Show SMILES CN([C@H]1C[C@H]2CNC(=O)C[C@H]2C1)c1ncnc2[nH]ccc12 |r|
Reactome pathway
US Patent
n/an/a 71n/an/an/an/a7.325
Jiangsu Hengrui Medicine Co., Ltd.; Shanghai Hengrui Pharmaceutical Co., Ltd.
US Patent
Assay Description
TBDIn vitro kinase assays described below can be used to determine the activity of a test compound for inhibiting the activity of JAK3 kinase. The te...
US Patent US9527851 (2016)
BindingDB Entry DOI: 10.7270/Q2D21VRM
Tyrosine-protein kinase JAK3
(Homo sapiens (Human))
BDBM260475
(US10428074, Example 147 | US9527851, 147 | US95278...)
Show SMILES CN([C@H]1C[C@H]2CNC(=O)C[C@H]2C1)c1ncnc2[nH]ccc12 |r|
Reactome pathway
US Patent
n/an/a 31n/an/an/an/a7.325
Jiangsu Hengrui Medicine Co., Ltd.; Shanghai Hengrui Pharmaceutical Co., Ltd.
US Patent
Assay Description
TBDIn vitro kinase assays described below can be used to determine the activity of a test compound for inhibiting the activity of JAK3 kinase. The te...
US Patent US9527851 (2016)
BindingDB Entry DOI: 10.7270/Q2D21VRM
Tyrosine-protein kinase JAK1
(Homo sapiens (Human))
BDBM260475
(US10428074, Example 147 | US9527851, 147 | US95278...)
Show SMILES CN([C@H]1C[C@H]2CNC(=O)C[C@H]2C1)c1ncnc2[nH]ccc12 |r|
Reactome pathway
US Patent
n/an/a 98n/an/an/an/an/an/a
Jiangsu Hengrui Medicine Co., Ltd.
US Patent
Assay Description
JAK1: In vitro kinase assays described below can be used to determine the activity of a test compound for inhibiting the activity of JAK1 kinase. The...
US Patent US10428074 (2019)
BindingDB Entry DOI: 10.7270/Q26D5WC6
Tyrosine-protein kinase JAK1
(Homo sapiens (Human))
BDBM260475
(US10428074, Example 147 | US9527851, 147 | US95278...)
Show SMILES CN([C@H]1C[C@H]2CNC(=O)C[C@H]2C1)c1ncnc2[nH]ccc12 |r|
Reactome pathway
US Patent
n/an/a 1n/an/an/an/an/an/a
Jiangsu Hengrui Medicine Co., Ltd.
US Patent
Assay Description
JAK1: In vitro kinase assays described below can be used to determine the activity of a test compound for inhibiting the activity of JAK1 kinase. The...
US Patent US10428074 (2019)
BindingDB Entry DOI: 10.7270/Q26D5WC6
Tyrosine-protein kinase JAK2
(Homo sapiens (Human))
BDBM260475
(US10428074, Example 147 | US9527851, 147 | US95278...)
Show SMILES CN([C@H]1C[C@H]2CNC(=O)C[C@H]2C1)c1ncnc2[nH]ccc12 |r|
Reactome pathway
US Patent
n/an/a 23n/an/an/an/an/an/a
Jiangsu Hengrui Medicine Co., Ltd.
US Patent
Assay Description
JAK2: In vitro kinase assays described below can be used to determine the activity of a test compound for inhibiting the activity of JAK2 kinase. The...
US Patent US10428074 (2019)
BindingDB Entry DOI: 10.7270/Q26D5WC6
Tyrosine-protein kinase JAK2
(Homo sapiens (Human))
BDBM260475
(US10428074, Example 147 | US9527851, 147 | US95278...)
Show SMILES CN([C@H]1C[C@H]2CNC(=O)C[C@H]2C1)c1ncnc2[nH]ccc12 |r|
Reactome pathway
US Patent
n/an/a 5n/an/an/an/an/an/a
Jiangsu Hengrui Medicine Co., Ltd.
US Patent
Assay Description
JAK2: In vitro kinase assays described below can be used to determine the activity of a test compound for inhibiting the activity of JAK2 kinase. The...
US Patent US10428074 (2019)
BindingDB Entry DOI: 10.7270/Q26D5WC6
Tyrosine-protein kinase JAK3
(Homo sapiens (Human))
BDBM260475
(US10428074, Example 147 | US9527851, 147 | US95278...)
Show SMILES CN([C@H]1C[C@H]2CNC(=O)C[C@H]2C1)c1ncnc2[nH]ccc12 |r|
Reactome pathway
US Patent
n/an/a 71n/an/an/an/an/an/a
Jiangsu Hengrui Medicine Co., Ltd.
US Patent
Assay Description
JAK3: In vitro kinase assays described below can be used to determine the activity of a test compound for inhibiting the activity of JAK3 kinase. The...
US Patent US10428074 (2019)
BindingDB Entry DOI: 10.7270/Q26D5WC6
Tyrosine-protein kinase JAK1
(Homo sapiens (Human))
BDBM260475
(US10428074, Example 147 | US9527851, 147 | US95278...)
Show SMILES CN([C@H]1C[C@H]2CNC(=O)C[C@H]2C1)c1ncnc2[nH]ccc12 |r|
Reactome pathway
US Patent
n/an/a 1n/an/an/an/a7.327
Jiangsu Hengrui Medicine Co., Ltd.; Shanghai Hengrui Pharmaceutical Co., Ltd.
US Patent
Assay Description
In vitro kinase assays described below can be used to determine the activity of a test compound for inhibiting the activity of JAK1 kinase. The test ...
US Patent US9527851 (2016)
BindingDB Entry DOI: 10.7270/Q2HD7TM2