BDBM26053 (1E)-5-[5-(piperidin-4-yl)-2-(pyridin-4-yl)furan-3-yl]-2,3-dihydro-1H-indene-1-hydroxylamine::furan-based compound, 14
SMILES: O=NC1CCc2cc(ccc12)-c1cc(oc1-c1ccncc1)C1CCNCC1
InChI Key: InChIKey=YERYFQKNIBQWGZ-UHFFFAOYSA-N
Data: 1 Kd
Activity Spreadsheet -- Enzyme Inhibition Constant Data from BindingDB
Found 1 hit for monomerid = 26053
Trg + Lig
Ki
nM
ΔG°
kcal/mole
IC50
nM
Kd
nM
EC50/IC50
nM
koff
s-1
kon
M-1s-1
pHTemp
°C
Serine/threonine-protein kinase B-raf
(Homo sapiens (Human))
BDBM26053
((1E)-5-[5-(piperidin-4-yl)-2-(pyridin-4-yl)furan-3...)
Show SMILES O=NC1CCc2cc(ccc12)-c1cc(oc1-c1ccncc1)C1CCNCC1
Show InChI InChI=1S/C23H23N3O2/c27-26-21-4-2-17-13-18(1-3-19(17)21)20-14-22(15-5-9-24-10-6-15)28-23(20)16-7-11-25-12-8-16/h1,3,7-8,11-15,21,24H,2,4-6,9-10H2
NCI pathway
Reactome pathway
n/an/an/a 2.40n/an/an/a7.522
GSK
Assay Description
The kinase enzyme, fluorescent ligand and a variable concentration of test compound are incubated together to reach thermodynamic equilibrium under c...
Bioorg Med Chem Lett 18: 4373-6 (2008)
Article DOI: 10.1016/j.bmcl.2008.06.070
BindingDB Entry DOI: 10.7270/Q26D5R86