BDBM260674 US9533985, 62
SMILES: Cn1c2cnccc2c(=O)n(-c2ccc(C[C@H](NC(=O)c3c(F)cc(NS(=O)(=O)c4ccc(cc4)-n4cccn4)cc3F)C(O)=O)cc2)c1=O
InChI Key: InChIKey=YDWJHQASZKEBFD-MHZLTWQESA-N
Data: 3 IC50
Activity Spreadsheet -- Enzyme Inhibition Constant Data from BindingDB
Found 3 hits for monomerid = 260674
Trg + Lig
Ki
nM
ΔG°
kcal/mole
IC50
nM
Kd
nM
EC50/IC50
nM
koff
s-1
kon
M-1s-1
pHTemp
°C
Mucosal addressin cell adhesion molecule 1 (MAdCAM-1)/Alpha-4 Beta-7 Integrin
(Mus musculus (Mouse)-Homo sapiens (Human))
BDBM260674
(US9533985, 62)
Show SMILES Cn1c2cnccc2c(=O)n(-c2ccc(C[C@H](NC(=O)c3c(F)cc(NS(=O)(=O)c4ccc(cc4)-n4cccn4)cc3F)C(O)=O)cc2)c1=O |r|
Show InChI InChI=1S/C33H25F2N7O7S/c1-40-28-18-36-13-11-24(28)31(44)42(33(40)47)22-5-3-19(4-6-22)15-27(32(45)46)38-30(43)29-25(34)16-20(17-26(29)35)39-50(48,49)23-9-7-21(8-10-23)41-14-2-12-37-41/h2-14,16-18,27,39H,15H2,1H3,(H,38,43)(H,45,46)/t27-/m0/s1
US Patent
n/an/a 0.640n/an/an/an/a9.64
EA Pharma Co., Ltd.
US Patent
Assay Description
The ability of test substances to inhibit the binding of a human B cell line, RPMI-8866, which is known to express α4β7 integrin, to MAdCA...
US Patent US9533985 (2017)
BindingDB Entry DOI: 10.7270/Q20C4TQ8
Mucosal addressin cell adhesion molecule 1 (MAdCAM-1)/Alpha-4 Beta-7 Integrin
(Mus musculus (Mouse)-Homo sapiens (Human))
BDBM260674
(US9533985, 62)
Show SMILES Cn1c2cnccc2c(=O)n(-c2ccc(C[C@H](NC(=O)c3c(F)cc(NS(=O)(=O)c4ccc(cc4)-n4cccn4)cc3F)C(O)=O)cc2)c1=O |r|
Show InChI InChI=1S/C33H25F2N7O7S/c1-40-28-18-36-13-11-24(28)31(44)42(33(40)47)22-5-3-19(4-6-22)15-27(32(45)46)38-30(43)29-25(34)16-20(17-26(29)35)39-50(48,49)23-9-7-21(8-10-23)41-14-2-12-37-41/h2-14,16-18,27,39H,15H2,1H3,(H,38,43)(H,45,46)/t27-/m0/s1
US Patent
n/an/a 13n/an/an/an/a9.64
EA Pharma Co., Ltd.
US Patent
Assay Description
The ability of test substances to inhibit the binding of a human B cell line, RPMI-8866, which is known to express α4β7 integrin, to MAdCA...
US Patent US9533985 (2017)
BindingDB Entry DOI: 10.7270/Q20C4TQ8
Vascular cell adhesion protein 1 (VCAM-1)/Alpha-4 Beta-1 Integrin
(Homo sapiens (Human))
BDBM260674
(US9533985, 62)
Show SMILES Cn1c2cnccc2c(=O)n(-c2ccc(C[C@H](NC(=O)c3c(F)cc(NS(=O)(=O)c4ccc(cc4)-n4cccn4)cc3F)C(O)=O)cc2)c1=O |r|
Show InChI InChI=1S/C33H25F2N7O7S/c1-40-28-18-36-13-11-24(28)31(44)42(33(40)47)22-5-3-19(4-6-22)15-27(32(45)46)38-30(43)29-25(34)16-20(17-26(29)35)39-50(48,49)23-9-7-21(8-10-23)41-14-2-12-37-41/h2-14,16-18,27,39H,15H2,1H3,(H,38,43)(H,45,46)/t27-/m0/s1
US Patent
n/an/a 100n/an/an/an/a9.64
EA Pharma Co., Ltd.
US Patent
Assay Description
The ability of test substances to inhibit the binding of a human T-cell line, Jurkat, which is known to express α4β1 integrin, to VCAM-1 w...
US Patent US9533985 (2017)
BindingDB Entry DOI: 10.7270/Q20C4TQ8