BDBM260830 US9540323, 16::US9540323, example 16
SMILES: CC1(C)CN(c2c1c(ccc2O)C(F)(F)F)c1ccccc1NC(=O)Nc1csc(Cl)n1
InChI Key: InChIKey=ZRSUKUSALDFEDU-UHFFFAOYSA-N
Data: 1 KI
Activity Spreadsheet -- Enzyme Inhibition Constant Data from BindingDB
Found 1 hit for monomerid = 260830
Trg + Lig
Ki
nM
ΔG°
kcal/mole
IC50
nM
Kd
nM
EC50/IC50
nM
koff
s-1
kon
M-1s-1
pHTemp
°C
Purinergic receptor P2Y1
(Homo sapiens (Human))
BDBM260830
(US9540323, 16 | US9540323, example 16)
Show SMILES CC1(C)CN(c2c1c(ccc2O)C(F)(F)F)c1ccccc1NC(=O)Nc1csc(Cl)n1
Show InChI InChI=1S/C21H18ClF3N4O2S/c1-20(2)10-29(17-14(30)8-7-11(16(17)20)21(23,24)25)13-6-4-3-5-12(13)26-19(31)28-15-9-32-18(22)27-15/h3-9,30H,10H2,1-2H3,(H2,26,28,31)
US Patent
6.20 -11.2n/an/an/an/an/a7.425
Bristol-Myers Squibb Company
US Patent
Assay Description
A SPA membrane binding assay was used to identify inhibitors of [33P] 2MeS-ADP binding to cloned human P2Y1 receptors (The P2Y1 receptor membranes we...
US Patent US9540323 (2017)
BindingDB Entry DOI: 10.7270/Q289141P