BDBM260840 US9540323, 26::US9540323, example 26
SMILES: CCC1(CC)CN(c2c1c(F)ccc2O)c1ccccc1NC(=O)Nc1ccc(cc1)C(C)(C)C
InChI Key: InChIKey=ZZOCTKMSRKKOEN-UHFFFAOYSA-N
Data: 1 KI
Activity Spreadsheet -- Enzyme Inhibition Constant Data from BindingDB
Found 1 hit for monomerid = 260840
Trg + Lig
Ki
nM
ΔG°
kcal/mole
IC50
nM
Kd
nM
EC50/IC50
nM
koff
s-1
kon
M-1s-1
pHTemp
°C
Purinergic receptor P2Y1
(Homo sapiens (Human))
BDBM260840
(US9540323, 26 | US9540323, example 26)
Show SMILES CCC1(CC)CN(c2c1c(F)ccc2O)c1ccccc1NC(=O)Nc1ccc(cc1)C(C)(C)C
Show InChI InChI=1S/C29H34FN3O2/c1-6-29(7-2)18-33(26-24(34)17-16-21(30)25(26)29)23-11-9-8-10-22(23)32-27(35)31-20-14-12-19(13-15-20)28(3,4)5/h8-17,34H,6-7,18H2,1-5H3,(H2,31,32,35)
US Patent
5.10 -11.3n/an/an/an/an/a7.425
Bristol-Myers Squibb Company
US Patent
Assay Description
A SPA membrane binding assay was used to identify inhibitors of [33P] 2MeS-ADP binding to cloned human P2Y1 receptors (The P2Y1 receptor membranes we...
US Patent US9540323 (2017)
BindingDB Entry DOI: 10.7270/Q289141P