BDBM260933 US9540323, 125::US9540323, example 125
SMILES: CC1(C)CN(c2c1c(ccc2O)-c1ccc(cn1)C(F)(F)F)c1ccccc1NC(=O)Nc1ccc(OC(F)(F)F)cc1
InChI Key: InChIKey=VEQJRAPIMULZDY-UHFFFAOYSA-N
Data: 1 KI
Activity Spreadsheet -- Enzyme Inhibition Constant Data from BindingDB
Found 1 hit for monomerid = 260933
Trg + Lig
Ki
nM
ΔG°
kcal/mole
IC50
nM
Kd
nM
EC50/IC50
nM
koff
s-1
kon
M-1s-1
pHTemp
°C
Purinergic receptor P2Y1
(Homo sapiens (Human))
BDBM260933
(US9540323, 125 | US9540323, example 125)
Show SMILES CC1(C)CN(c2c1c(ccc2O)-c1ccc(cn1)C(F)(F)F)c1ccccc1NC(=O)Nc1ccc(OC(F)(F)F)cc1
Show InChI InChI=1S/C30H24F6N4O3/c1-28(2)16-40(26-24(41)14-12-20(25(26)28)21-13-7-17(15-37-21)29(31,32)33)23-6-4-3-5-22(23)39-27(42)38-18-8-10-19(11-9-18)43-30(34,35)36/h3-15,41H,16H2,1-2H3,(H2,38,39,42)
US Patent
4.80 -11.3n/an/an/an/an/a7.425
Bristol-Myers Squibb Company
US Patent
Assay Description
A SPA membrane binding assay was used to identify inhibitors of [33P] 2MeS-ADP binding to cloned human P2Y1 receptors (The P2Y1 receptor membranes we...
US Patent US9540323 (2017)
BindingDB Entry DOI: 10.7270/Q289141P