BDBM260996 US9540323, 212::US9540323, example 212
SMILES: CC1(C)CN(c2c1c(c(F)cc2O)-c1ccc(F)cc1)c1ccccc1NC(=O)Nc1csc(Cl)n1
InChI Key: InChIKey=KEVPDZXWUIKYPS-UHFFFAOYSA-N
Data: 1 KI
Activity Spreadsheet -- Enzyme Inhibition Constant Data from BindingDB
Found 1 hit for monomerid = 260996
Trg + Lig
Ki
nM
ΔG°
kcal/mole
IC50
nM
Kd
nM
EC50/IC50
nM
koff
s-1
kon
M-1s-1
pHTemp
°C
Purinergic receptor P2Y1
(Homo sapiens (Human))
BDBM260996
(US9540323, 212 | US9540323, example 212)
Show SMILES CC1(C)CN(c2c1c(c(F)cc2O)-c1ccc(F)cc1)c1ccccc1NC(=O)Nc1csc(Cl)n1
Show InChI InChI=1S/C26H21ClF2N4O2S/c1-26(2)13-33(18-6-4-3-5-17(18)30-25(35)32-20-12-36-24(27)31-20)23-19(34)11-16(29)21(22(23)26)14-7-9-15(28)10-8-14/h3-12,34H,13H2,1-2H3,(H2,30,32,35)
US Patent
4.90 -11.3n/an/an/an/an/a7.425
Bristol-Myers Squibb Company
US Patent
Assay Description
A SPA membrane binding assay was used to identify inhibitors of [33P] 2MeS-ADP binding to cloned human P2Y1 receptors (The P2Y1 receptor membranes we...
US Patent US9540323 (2017)
BindingDB Entry DOI: 10.7270/Q289141P