BDBM261164 1-(4-(3-(1-(4-amino-3-methyl-1H- pyrazolo[3,4-d]pyrimidin-1- yl)ethyl)-5-chloro-2-methoxy-6- methylphenyl)pyridin-2- yl)azetidin-3-ol3::US9707233, 187
SMILES: COc1c(cc(Cl)c(C)c1-c1cncc(c1)N1CC(O)C1)C(C)Nc1ncnc(N)c1C(C)=N
InChI Key: InChIKey=AHEBMJSPCZIQGP-UHFFFAOYSA-N
Data: 1 IC50
Activity Spreadsheet -- Enzyme Inhibition Constant Data from BindingDB
Found 1 hit for monomerid = 261164
Trg + Lig
Ki
nM
ΔG°
kcal/mole
IC50
nM
Kd
nM
EC50/IC50
nM
koff
s-1
kon
M-1s-1
pHTemp
°C
p110delta/p85alpha
(Homo sapiens (Human))
BDBM261164
(1-(4-(3-(1-(4-amino-3-methyl-1H- pyrazolo[3,4-d]py...)
Show SMILES COc1c(cc(Cl)c(C)c1-c1cncc(c1)N1CC(O)C1)C(C)Nc1ncnc(N)c1C(C)=N
Show InChI InChI=1S/C24H28ClN7O2/c1-12-19(25)6-18(14(3)31-24-21(13(2)26)23(27)29-11-30-24)22(34-4)20(12)15-5-16(8-28-7-15)32-9-17(33)10-32/h5-8,11,14,17,26,33H,9-10H2,1-4H3,(H3,27,29,30,31)
US Patent
n/an/a<10n/an/an/an/a6.725
Incyte Holdings Corporation; Incyte Corporation
US Patent
Assay Description
Lipid kinase substrate, phosphoinositol-4,5-bisphosphate (PIP2), are purchased from Echelon Biosciences (Salt Lake City, Utah). PI3K isoforms α,...
US Patent US9707233 (2017)
BindingDB Entry DOI: 10.7270/Q2S46V0R