null
SMILES: COc1c(cc(Cl)c(C)c1-c1ccc(OCCO)nc1)C(C)Nc1ncnc(N)c1C(C)=N
InChI Key: InChIKey=BDFCPFCZPIZCOE-UHFFFAOYSA-N
Activity Spreadsheet -- Enzyme Inhibition Constant Data from BindingDB
Found 3 hits for monomerid = 261165
Trg + Lig
Ki
nM
ΔG°
kcal/mole
IC50
nM
Kd
nM
EC50/IC50
nM
koff
s-1
kon
M-1s-1
pHTemp
°C
Phosphatidylinositol 4,5-bisphosphate 3-kinase catalytic subunit beta/delta isoform
(Homo sapiens (Human))
BDBM261165
(2-(5-(3-(1-(4-Amino-3-methyl-1H-pyrazolo[3,4-d]pyr...)
Show SMILES COc1c(cc(Cl)c(C)c1-c1ccc(OCCO)nc1)C(C)Nc1ncnc(N)c1C(C)=N
Show InChI InChI=1S/C23H27ClN6O3/c1-12-17(24)9-16(14(3)30-23-20(13(2)25)22(26)28-11-29-23)21(32-4)19(12)15-5-6-18(27-10-15)33-8-7-31/h5-6,9-11,14,25,31H,7-8H2,1-4H3,(H3,26,28,29,30)
US Patent
n/an/a<10n/an/an/an/a6.725
Incyte Holdings Corporation; Incyte Corporation
US Patent
Assay Description
Lipid kinase substrate, phosphoinositol-4,5-bisphosphate (PIP2), are purchased from Echelon Biosciences (Salt Lake City, Utah). PI3K isoforms α,...
US Patent US9707233 (2017)
BindingDB Entry DOI: 10.7270/Q2S46V0R
Phosphatidylinositol 4,5-bisphosphate 3-kinase catalytic subunit delta isoform
(Homo sapiens (Human))
BDBM261165
(2-(5-(3-(1-(4-Amino-3-methyl-1H-pyrazolo[3,4-d]pyr...)
Show SMILES COc1c(cc(Cl)c(C)c1-c1ccc(OCCO)nc1)C(C)Nc1ncnc(N)c1C(C)=N
Show InChI InChI=1S/C23H27ClN6O3/c1-12-17(24)9-16(14(3)30-23-20(13(2)25)22(26)28-11-29-23)21(32-4)19(12)15-5-6-18(27-10-15)33-8-7-31/h5-6,9-11,14,25,31H,7-8H2,1-4H3,(H3,26,28,29,30)
NCI pathway
Reactome pathway
US Patent
n/an/a<10n/an/an/an/an/an/a
Incyte Holdings Corporation; Incyte Corporation
US Patent
Assay Description
[γ-33P]ATP (10 mCi/mL) was purchased from PerkinElmer (Waltham, Mass.). Lipid kinase substrate, D-myo-Phosphatidylinositol 4,5-bisphosphate (Ptd...
US Patent US9730939 (2017)
BindingDB Entry DOI: 10.7270/Q2GB265W
Phosphatidylinositol 4,5-bisphosphate 3-kinase catalytic subunit delta isoform
(Homo sapiens (Human))
BDBM261165
(2-(5-(3-(1-(4-Amino-3-methyl-1H-pyrazolo[3,4-d]pyr...)
Show SMILES COc1c(cc(Cl)c(C)c1-c1ccc(OCCO)nc1)C(C)Nc1ncnc(N)c1C(C)=N
Show InChI InChI=1S/C23H27ClN6O3/c1-12-17(24)9-16(14(3)30-23-20(13(2)25)22(26)28-11-29-23)21(32-4)19(12)15-5-6-18(27-10-15)33-8-7-31/h5-6,9-11,14,25,31H,7-8H2,1-4H3,(H3,26,28,29,30)
NCI pathway
Reactome pathway
US Patent
n/an/a<10n/an/an/an/a6.725
Incyte Holdings Corporation; Incyte Corporation
US Patent
Assay Description
[γ-33P]ATP (10 mCi/mL) was purchased from Perkin-Elmer (Waltham, Mass.). Lipid kinase substrate, D-myo-Phosphatidylinositol 4,5-bisphosphate (Pt...
US Patent US10092570 (2018)
BindingDB Entry DOI: 10.7270/Q2PZ5BW5