null
SMILES: CCOc1c(cc(Cl)c(C)c1-c1cnn(CC(=O)NC)c1)C(C)n1nc(C)c2c(N)ncnc12
InChI Key: InChIKey=XOCBICZFWUYTBH-UHFFFAOYSA-N
Activity Spreadsheet -- Enzyme Inhibition Constant Data from BindingDB
Found 5 hits for monomerid = 261181
Trg + Lig
Ki
nM
ΔG°
kcal/mole
IC50
nM
Kd
nM
EC50/IC50
nM
koff
s-1
kon
M-1s-1
pHTemp
°C
Phosphatidylinositol 4,5-bisphosphate 3-kinase catalytic subunit beta/delta isoform
(Homo sapiens (Human))
BDBM261181
(2-(4-(3-(1-(4-amino-3-methyl-1H- pyrazolo[3,4-d]py...)
Show SMILES CCOc1c(cc(Cl)c(C)c1-c1cnn(CC(=O)NC)c1)C(C)n1nc(C)c2c(N)ncnc12
Show InChI InChI=1S/C23H27ClN8O2/c1-6-34-21-16(14(4)32-23-20(13(3)30-32)22(25)27-11-28-23)7-17(24)12(2)19(21)15-8-29-31(9-15)10-18(33)26-5/h7-9,11,14H,6,10H2,1-5H3,(H,26,33)(H2,25,27,28)
US Patent
n/an/a<10n/an/an/an/a6.725
Incyte Holdings Corporation; Incyte Corporation
US Patent
Assay Description
Lipid kinase substrate, phosphoinositol-4,5-bisphosphate (PIP2), are purchased from Echelon Biosciences (Salt Lake City, Utah). PI3K isoforms α,...
US Patent US9707233 (2017)
BindingDB Entry DOI: 10.7270/Q2S46V0R
Phosphatidylinositol 4,5-bisphosphate 3-kinase catalytic subunit delta isoform
(Homo sapiens (Human))
BDBM261181
(2-(4-(3-(1-(4-amino-3-methyl-1H- pyrazolo[3,4-d]py...)
Show SMILES CCOc1c(cc(Cl)c(C)c1-c1cnn(CC(=O)NC)c1)C(C)n1nc(C)c2c(N)ncnc12
Show InChI InChI=1S/C23H27ClN8O2/c1-6-34-21-16(14(4)32-23-20(13(3)30-32)22(25)27-11-28-23)7-17(24)12(2)19(21)15-8-29-31(9-15)10-18(33)26-5/h7-9,11,14H,6,10H2,1-5H3,(H,26,33)(H2,25,27,28)
NCI pathway
Reactome pathway
US Patent
n/an/a<10n/an/an/an/a6.725
Incyte Holdings Corporation; Incyte Corporation
US Patent
Assay Description
[γ-33P]ATP (10 mCi/mL) was purchased from Perkin-Elmer (Waltham, Mass.). Lipid kinase substrate, D-myo-Phosphatidylinositol 4,5-bisphosphate (Pt...
US Patent US10092570 (2018)
BindingDB Entry DOI: 10.7270/Q2PZ5BW5
Phosphatidylinositol 4,5-bisphosphate 3-kinase catalytic subunit delta isoform
(Homo sapiens (Human))
BDBM261181
(2-(4-(3-(1-(4-amino-3-methyl-1H- pyrazolo[3,4-d]py...)
Show SMILES CCOc1c(cc(Cl)c(C)c1-c1cnn(CC(=O)NC)c1)C(C)n1nc(C)c2c(N)ncnc12
Show InChI InChI=1S/C23H27ClN8O2/c1-6-34-21-16(14(4)32-23-20(13(3)30-32)22(25)27-11-28-23)7-17(24)12(2)19(21)15-8-29-31(9-15)10-18(33)26-5/h7-9,11,14H,6,10H2,1-5H3,(H,26,33)(H2,25,27,28)
NCI pathway
Reactome pathway
US Patent
n/an/a<10n/an/an/an/an/an/a
Incyte Corporation; Incyte Holdings Corporation
US Patent
Assay Description
The kinase reaction was conducted in polystyrene 384-well matrix white plate from Thermo Fisher Scientific in a final volume of 25 uL. Inhibitors wer...
US Patent US10646492 (2020)
BindingDB Entry DOI: 10.7270/Q2125WP7
Phosphatidylinositol 4,5-bisphosphate 3-kinase catalytic subunit delta isoform
(Homo sapiens (Human))
BDBM261181
(2-(4-(3-(1-(4-amino-3-methyl-1H- pyrazolo[3,4-d]py...)
Show SMILES CCOc1c(cc(Cl)c(C)c1-c1cnn(CC(=O)NC)c1)C(C)n1nc(C)c2c(N)ncnc12
Show InChI InChI=1S/C23H27ClN8O2/c1-6-34-21-16(14(4)32-23-20(13(3)30-32)22(25)27-11-28-23)7-17(24)12(2)19(21)15-8-29-31(9-15)10-18(33)26-5/h7-9,11,14H,6,10H2,1-5H3,(H,26,33)(H2,25,27,28)
NCI pathway
Reactome pathway
US Patent
n/an/a<10n/an/an/an/an/an/a
Incyte Holdings Corporation
US Patent
Assay Description
[γ-33P]ATP (10 mCi/mL) was purchased from Perkin-Elmer (Waltham, Mass.). Lipid kinase substrate, D-myo-Phosphatidylinositol 4,5-bisphosphate (Pt...
US Patent US10376513 (2019)
BindingDB Entry DOI: 10.7270/Q2GQ7142
Phosphatidylinositol 4,5-bisphosphate 3-kinase catalytic subunit delta isoform
(Homo sapiens (Human))
BDBM261181
(2-(4-(3-(1-(4-amino-3-methyl-1H- pyrazolo[3,4-d]py...)
Show SMILES CCOc1c(cc(Cl)c(C)c1-c1cnn(CC(=O)NC)c1)C(C)n1nc(C)c2c(N)ncnc12
Show InChI InChI=1S/C23H27ClN8O2/c1-6-34-21-16(14(4)32-23-20(13(3)30-32)22(25)27-11-28-23)7-17(24)12(2)19(21)15-8-29-31(9-15)10-18(33)26-5/h7-9,11,14H,6,10H2,1-5H3,(H,26,33)(H2,25,27,28)
NCI pathway
Reactome pathway
US Patent
n/an/a<10n/an/an/an/an/an/a
Incyte Holdings Corporation; Incyte Corporation
US Patent
Assay Description
[γ-33P]ATP (10 mCi/mL) was purchased from PerkinElmer (Waltham, Mass.). Lipid kinase substrate, D-myo-Phosphatidylinositol 4,5-bisphosphate (Ptd...
US Patent US9730939 (2017)
BindingDB Entry DOI: 10.7270/Q2GB265W