BDBM261184 2-(4-(3-(1-(4-amino-3-methyl-1H- pyrazolo[3,4-d]pyrimidin-1- yl)ethyl)-5-chloro-2-methoxy-6- methylphenyl)-1H-pyrazol-1-yl)- N,N-dimethylpropanamide4::US10646492, Example 207::US9707233, 207
SMILES: CCOc1c(cc(Cl)c(C)c1-c1cnn(c1)C(C)C(=O)N(C)C)C(C)n1nc(C)c2c(N)ncnc12
InChI Key: InChIKey=QTEMHQCQDQARBZ-UHFFFAOYSA-N
Data: 2 IC50
Activity Spreadsheet -- Enzyme Inhibition Constant Data from BindingDB
Found 2 hits for monomerid = 261184
Trg + Lig
Ki
nM
ΔG°
kcal/mole
IC50
nM
Kd
nM
EC50/IC50
nM
koff
s-1
kon
M-1s-1
pHTemp
°C
Phosphatidylinositol 4,5-bisphosphate 3-kinase catalytic subunit delta isoform
(Homo sapiens (Human))
BDBM261184
(2-(4-(3-(1-(4-amino-3-methyl-1H- pyrazolo[3,4-d]py...)
Show SMILES CCOc1c(cc(Cl)c(C)c1-c1cnn(c1)C(C)C(=O)N(C)C)C(C)n1nc(C)c2c(N)ncnc12
Show InChI InChI=1S/C25H31ClN8O2/c1-8-36-22-18(15(4)34-24-21(14(3)31-34)23(27)28-12-29-24)9-19(26)13(2)20(22)17-10-30-33(11-17)16(5)25(35)32(6)7/h9-12,15-16H,8H2,1-7H3,(H2,27,28,29)
NCI pathway
Reactome pathway
US Patent
n/an/a<10n/an/an/an/an/an/a
Incyte Corporation; Incyte Holdings Corporation
US Patent
Assay Description
The kinase reaction was conducted in polystyrene 384-well matrix white plate from Thermo Fisher Scientific in a final volume of 25 uL. Inhibitors wer...
US Patent US10646492 (2020)
p110delta/p85alpha
(Homo sapiens (Human))
BDBM261184
(2-(4-(3-(1-(4-amino-3-methyl-1H- pyrazolo[3,4-d]py...)
Show SMILES CCOc1c(cc(Cl)c(C)c1-c1cnn(c1)C(C)C(=O)N(C)C)C(C)n1nc(C)c2c(N)ncnc12
Show InChI InChI=1S/C25H31ClN8O2/c1-8-36-22-18(15(4)34-24-21(14(3)31-34)23(27)28-12-29-24)9-19(26)13(2)20(22)17-10-30-33(11-17)16(5)25(35)32(6)7/h9-12,15-16H,8H2,1-7H3,(H2,27,28,29)
US Patent
n/an/a<10n/an/an/an/a6.725
Incyte Holdings Corporation; Incyte Corporation
US Patent
Assay Description
Lipid kinase substrate, phosphoinositol-4,5-bisphosphate (PIP2), are purchased from Echelon Biosciences (Salt Lake City, Utah). PI3K isoforms α,...
US Patent US9707233 (2017)
BindingDB Entry DOI: 10.7270/Q2S46V0R