BDBM26137 (2-phenylphenyl)boranediol::Phenylboronic Acid, 16::Phenylboronic acid, 24
SMILES: OB(O)c1ccccc1-c1ccccc1
InChI Key: InChIKey=HYCYKHYFIWHGEX-UHFFFAOYSA-N
Data: 3 IC50
Activity Spreadsheet -- Enzyme Inhibition Constant Data from BindingDB
Found 4 hits for monomerid = 26137
Trg + Lig
Ki
nM
ΔG°
kcal/mole
IC50
nM
Kd
nM
EC50/IC50
nM
koff
s-1
kon
M-1s-1
pHTemp
°C
Fatty-acid amide hydrolase 1 (aa 30-579)
(Rattus norvegicus (rat))
BDBM26137
((2-phenylphenyl)boranediol | Phenylboronic Acid, 1...)
Show SMILES OB(O)c1ccccc1-c1ccccc1
Show InChI InChI=1S/C12H11BO2/c14-13(15)12-9-5-4-8-11(12)10-6-2-1-3-7-10/h1-9,14-15H
n/an/a 1.10E+5n/an/an/an/a7.437
University of Oxford
Assay Description
[3H]Ethanolamine produced from [3H]AEA hydrolysis was used to calculate FAAH activity and was measured by scintillation counting of the aqueous phase...
J Med Chem 51: 7057-60 (2008)
Article DOI: 10.1021/jm801051t
BindingDB Entry DOI: 10.7270/Q25D8Q58
Acyl-protein thioesterase 2
(Homo sapiens (Human))
BDBM26137
((2-phenylphenyl)boranediol | Phenylboronic Acid, 1...)
Show SMILES OB(O)c1ccccc1-c1ccccc1
Show InChI InChI=1S/C12H11BO2/c14-13(15)12-9-5-4-8-11(12)10-6-2-1-3-7-10/h1-9,14-15H
n/an/a>5.00E+4n/an/an/an/an/an/a
Technical University of Dortmund
Assay Description
The enzyme activities were determined by measuring the release of fluorescent 6,8-difluoro-4-methylumbelliferone (DiFMU) by the APT hydrolysis of DiF...
Chembiochem 14: 115-22 (2013)
Article DOI: 10.1002/cbic.201200571
BindingDB Entry DOI: 10.7270/Q2NS0SG7
Acyl-protein thioesterase 1
(Homo sapiens (Human))
BDBM26137
((2-phenylphenyl)boranediol | Phenylboronic Acid, 1...)
Show SMILES OB(O)c1ccccc1-c1ccccc1
Show InChI InChI=1S/C12H11BO2/c14-13(15)12-9-5-4-8-11(12)10-6-2-1-3-7-10/h1-9,14-15H
Reactome pathway
n/an/a>5.00E+4n/an/an/an/an/an/a
Technical University of Dortmund
Assay Description
The enzyme activities were determined by measuring the release of fluorescent 6,8-difluoro-4-methylumbelliferone (DiFMU) by the APT hydrolysis of DiF...
Chembiochem 14: 115-22 (2013)
Article DOI: 10.1002/cbic.201200571
BindingDB Entry DOI: 10.7270/Q2NS0SG7
Monoglyceride lipase
(Homo sapiens (Human))
BDBM26137
((2-phenylphenyl)boranediol | Phenylboronic Acid, 1...)
Show SMILES OB(O)c1ccccc1-c1ccccc1
Show InChI InChI=1S/C12H11BO2/c14-13(15)12-9-5-4-8-11(12)10-6-2-1-3-7-10/h1-9,14-15H
Reactome pathway
n/an/an/an/an/an/an/an/an/a
University of Oxford
Assay Description
The endpoint enzymatic assay was developed to quantify human recombinant MGL activity with 2-AG. The formation of arachidonic acid and depletion of ...
J Med Chem 51: 7057-60 (2008)
Article DOI: 10.1021/jm801051t
BindingDB Entry DOI: 10.7270/Q25D8Q58