BDBM26146 2,4-dianilino pyrimidine, 3::3-({4-[(3-hydroxyphenyl)amino]pyrimidin-2-yl}amino)benzamide
SMILES: NC(=O)c1cccc(Nc2nccc(Nc3cccc(O)c3)n2)c1
InChI Key: InChIKey=PORARHJSZZARST-UHFFFAOYSA-N
Data: 1 IC50
PDB links: 1 PDB ID contains this monomer as substructures. 1 PDB ID contains inhibitors having a similarity of 90% to this monomer.
Activity Spreadsheet -- Enzyme Inhibition Constant Data from BindingDB
Found 1 hit for monomerid = 26146
Trg + Lig
Ki
nM
ΔG°
kcal/mole
IC50
nM
Kd
nM
EC50/IC50
nM
koff
s-1
kon
M-1s-1
pHTemp
°C
Lck
(Mus musculus)
BDBM26146
(2,4-dianilino pyrimidine, 3 | 3-({4-[(3-hydroxyphe...)
Show SMILES NC(=O)c1cccc(Nc2nccc(Nc3cccc(O)c3)n2)c1
Show InChI InChI=1S/C17H15N5O2/c18-16(24)11-3-1-4-12(9-11)21-17-19-8-7-15(22-17)20-13-5-2-6-14(23)10-13/h1-10,23H,(H2,18,24)(H2,19,20,21,22)
Reactome pathway
n/an/a 130n/an/an/an/a7.422
GSK
Assay Description
Lck activity was assessed using a TR-FRET assay in a 384-well plate format. The degree of phosphorylation of Biotinylated substrate was measured usin...
Bioorg Med Chem Lett 17: 4363-8 (2007)
Article DOI: 10.1016/j.bmcl.2007.04.029
BindingDB Entry DOI: 10.7270/Q21R6NTD