null
SMILES: O[C@H]1COCC[C@@H]1NC(=O)c1cc(Cc2ccc(cc2)C#N)c2ccccc2c1F
InChI Key: InChIKey=JEEWUVRTVKDADJ-VXKWHMMOSA-N
Activity Spreadsheet -- Enzyme Inhibition Constant Data from BindingDB
Found 2 hits for monomerid = 261727
Trg + Lig
Ki
nM
ΔG°
kcal/mole
IC50
nM
Kd
nM
EC50/IC50
nM
koff
s-1
kon
M-1s-1
pHTemp
°C
Muscarinic acetylcholine receptor M1
(RAT)
BDBM261727
(4-(4-cyanobenzyl)- 1-fluoro-N- ((3RS,4SR)-3- hydro...)
Show SMILES O[C@H]1COCC[C@@H]1NC(=O)c1cc(Cc2ccc(cc2)C#N)c2ccccc2c1F |r|
Show InChI InChI=1S/C24H21FN2O3/c25-23-19-4-2-1-3-18(19)17(11-15-5-7-16(13-26)8-6-15)12-20(23)24(29)27-21-9-10-30-14-22(21)28/h1-8,12,21-22,28H,9-11,14H2,(H,27,29)/t21-,22-/m0/s1
Reactome pathway
US Patent
n/an/an/an/a 71n/an/an/an/a
HOFFMANN-LA-ROCHE INC.
US Patent
Assay Description
The assay is designed to select compounds that possess modulator activity at the acetylcholine muscarinic receptor expressed in CHO cells by measurin...
US Patent US9708302 (2017)
BindingDB Entry DOI: 10.7270/Q2BV7JMP
Muscarinic acetylcholine receptor M1
(Homo sapiens (Human))
BDBM261727
(4-(4-cyanobenzyl)- 1-fluoro-N- ((3RS,4SR)-3- hydro...)
Show SMILES O[C@H]1COCC[C@@H]1NC(=O)c1cc(Cc2ccc(cc2)C#N)c2ccccc2c1F |r|
Show InChI InChI=1S/C24H21FN2O3/c25-23-19-4-2-1-3-18(19)17(11-15-5-7-16(13-26)8-6-15)12-20(23)24(29)27-21-9-10-30-14-22(21)28/h1-8,12,21-22,28H,9-11,14H2,(H,27,29)/t21-,22-/m0/s1
US Patent
n/an/an/an/a 67n/an/an/an/a
HOFFMANN-LA-ROCHE INC.
US Patent
Assay Description
The assay is designed to select compounds that possess modulator activity at the acetylcholine muscarinic receptor expressed in CHO cells by measurin...
US Patent US9708302 (2017)
BindingDB Entry DOI: 10.7270/Q2BV7JMP