BDBM261728 1-fluoro-4-(2-fluoro- 4-(1-methyl-1H- pyrazol-4- yl)benzyl)-N- ((3RS,4SR)-3- hydroxytetrahydro- 2H-pyran-4-yl)-2- naphthamide::US9708302, 14
SMILES: Cn1cc(cn1)-c1ccc(Cc2cc(C(=O)N[C@H]3CCOC[C@@H]3O)c(F)c3ccccc23)c(F)c1
InChI Key: InChIKey=GFRKKRCGBSUEOH-DQEYMECFSA-N
Data: 2 EC50
Activity Spreadsheet -- Enzyme Inhibition Constant Data from BindingDB
Found 2 hits for monomerid = 261728
Trg + Lig
Ki
nM
ΔG°
kcal/mole
IC50
nM
Kd
nM
EC50/IC50
nM
koff
s-1
kon
M-1s-1
pHTemp
°C
Muscarinic acetylcholine receptor M1
(RAT)
BDBM261728
(1-fluoro-4-(2-fluoro- 4-(1-methyl-1H- pyrazol-4- y...)
Show SMILES Cn1cc(cn1)-c1ccc(Cc2cc(C(=O)N[C@H]3CCOC[C@@H]3O)c(F)c3ccccc23)c(F)c1 |r|
Show InChI InChI=1S/C27H25F2N3O3/c1-32-14-19(13-30-32)16-6-7-17(23(28)12-16)10-18-11-22(26(29)21-5-3-2-4-20(18)21)27(34)31-24-8-9-35-15-25(24)33/h2-7,11-14,24-25,33H,8-10,15H2,1H3,(H,31,34)/t24-,25-/m0/s1
Reactome pathway
US Patent
n/an/an/an/a 14n/an/an/an/a
HOFFMANN-LA-ROCHE INC.
US Patent
Assay Description
The assay is designed to select compounds that possess modulator activity at the acetylcholine muscarinic receptor expressed in CHO cells by measurin...
US Patent US9708302 (2017)
BindingDB Entry DOI: 10.7270/Q2BV7JMP
Muscarinic acetylcholine receptor M1
(Homo sapiens (Human))
BDBM261728
(1-fluoro-4-(2-fluoro- 4-(1-methyl-1H- pyrazol-4- y...)
Show SMILES Cn1cc(cn1)-c1ccc(Cc2cc(C(=O)N[C@H]3CCOC[C@@H]3O)c(F)c3ccccc23)c(F)c1 |r|
Show InChI InChI=1S/C27H25F2N3O3/c1-32-14-19(13-30-32)16-6-7-17(23(28)12-16)10-18-11-22(26(29)21-5-3-2-4-20(18)21)27(34)31-24-8-9-35-15-25(24)33/h2-7,11-14,24-25,33H,8-10,15H2,1H3,(H,31,34)/t24-,25-/m0/s1
US Patent
n/an/an/an/a 14n/an/an/an/a
HOFFMANN-LA-ROCHE INC.
US Patent
Assay Description
The assay is designed to select compounds that possess modulator activity at the acetylcholine muscarinic receptor expressed in CHO cells by measurin...
US Patent US9708302 (2017)
BindingDB Entry DOI: 10.7270/Q2BV7JMP