BDBM26204 (3S,6S,7R,9aS)-6-[(2S)-2-aminobutanamido]-7-(aminomethyl)-N-(diphenylmethyl)-5-oxo-octahydro-1H-pyrrolo[1,2-a]azepine-3-carboxamide::BMC175834 Compound 4a::Smac010
SMILES: CC[C@H](N)C(=O)N[C@H]1[C@@H](CN)CC[C@H]2CC[C@H](N2C1=O)C(=O)NC(c1ccccc1)c1ccccc1
InChI Key: InChIKey=XXJHZERDDCOFPK-FCRIMTMASA-N
Data: 1 KI  3 IC50
PDB links: 1 PDB ID matches this monomer. 1 PDB ID contains this monomer as substructures. 1 PDB ID contains inhibitors having a similarity of 90% to this monomer.
Activity Spreadsheet -- Enzyme Inhibition Constant Data from BindingDB
Found 3 hits for monomerid = 26204
Trg + Lig
Ki
nM
ΔG°
kcal/mole
IC50
nM
Kd
nM
EC50/IC50
nM
koff
s-1
kon
M-1s-1
pHTemp
°C
XIAP-BIR3
(Homo sapiens (Human))
BDBM26204
((3S,6S,7R,9aS)-6-[(2S)-2-aminobutanamido]-7-(amino...)
Show SMILES CC[C@H](N)C(=O)N[C@H]1[C@@H](CN)CC[C@H]2CC[C@H](N2C1=O)C(=O)NC(c1ccccc1)c1ccccc1 |r|
Show InChI InChI=1S/C28H37N5O3/c1-2-22(30)26(34)32-25-20(17-29)13-14-21-15-16-23(33(21)28(25)36)27(35)31-24(18-9-5-3-6-10-18)19-11-7-4-8-12-19/h3-12,20-25H,2,13-17,29-30H2,1H3,(H,31,35)(H,32,34)/t20-,21+,22+,23+,25+/m1/s1
Reactome pathway
870 -8.18 970n/an/an/an/a7.522
University of Milano
Assay Description
Fluorescence polarization was measured on an Ultra plate reader (Tecan) at excitation and emission wavelengths of 485 and 530 nm, respectively. The e...
J Mol Biol 384: 673-89 (2008)
Article DOI: 10.1016/j.jmb.2008.09.064
BindingDB Entry DOI: 10.7270/Q2NG4NZ8
3D
3D Structure (crystal)
X-linked inhibitor of apoptosis protein (XIAP)
(Homo sapiens (Human))
BDBM26204
((3S,6S,7R,9aS)-6-[(2S)-2-aminobutanamido]-7-(amino...)
Show SMILES CC[C@H](N)C(=O)N[C@H]1[C@@H](CN)CC[C@H]2CC[C@H](N2C1=O)C(=O)NC(c1ccccc1)c1ccccc1 |r|
Show InChI InChI=1S/C28H37N5O3/c1-2-22(30)26(34)32-25-20(17-29)13-14-21-15-16-23(33(21)28(25)36)27(35)31-24(18-9-5-3-6-10-18)19-11-7-4-8-12-19/h3-12,20-25H,2,13-17,29-30H2,1H3,(H,31,35)(H,32,34)/t20-,21+,22+,23+,25+/m1/s1
n/an/a 110n/an/an/an/an/an/a
Universita degli Studi di Milano
Assay Description
Fluorescence polarization was measured on an Ultra plate reader (Tecan) at excitation and emission wavelengths of 485 and 530 nm, respectively. The e...
Bioorg Med Chem 17: 5834-56 (2009)
Article DOI: 10.1016/j.bmc.2009.07.009
BindingDB Entry DOI: 10.7270/Q28W3BNV
3D
3D Structure (crystal)
XIAP-BIR3
(Homo sapiens (Human))
BDBM26204
((3S,6S,7R,9aS)-6-[(2S)-2-aminobutanamido]-7-(amino...)
Show SMILES CC[C@H](N)C(=O)N[C@H]1[C@@H](CN)CC[C@H]2CC[C@H](N2C1=O)C(=O)NC(c1ccccc1)c1ccccc1 |r|
Show InChI InChI=1S/C28H37N5O3/c1-2-22(30)26(34)32-25-20(17-29)13-14-21-15-16-23(33(21)28(25)36)27(35)31-24(18-9-5-3-6-10-18)19-11-7-4-8-12-19/h3-12,20-25H,2,13-17,29-30H2,1H3,(H,31,35)(H,32,34)/t20-,21+,22+,23+,25+/m1/s1
n/an/a 970n/an/an/an/a7.523
Universita degli Studi di Milano
Assay Description
Fluorescence polarization was measured on an Ultra plate reader (Tecan) at excitation and emission wavelengths of 485 and 530 nm, respectively. The e...
Bioorg Med Chem 17: 5834-56 (2009)
Article DOI: 10.1016/j.bmc.2009.07.009
BindingDB Entry DOI: 10.7270/Q28W3BNV