BDBM26205 (3S,6S,7R,9aS)-6-[(2S)-2-aminobutanamido]-7-(2-aminoethyl)-N-(diphenylmethyl)-5-oxo-octahydro-1H-pyrrolo[1,2-a]azepine-3-carboxamide::BMC175834 Compound 32a::Smac037
SMILES: CC[C@H](N)C(=O)N[C@H]1[C@@H](CCN)CC[C@H]2CC[C@H](N2C1=O)C(=O)NC(c1ccccc1)c1ccccc1
InChI Key: InChIKey=KQHWCFZCUNTTCW-VEGWMBEDSA-N
Data: 1 KI  3 IC50
PDB links: 2 PDB IDs match this monomer.
Activity Spreadsheet -- Enzyme Inhibition Constant Data from BindingDB
Found 3 hits for monomerid = 26205
Trg + Lig
Ki
nM
ΔG°
kcal/mole
IC50
nM
Kd
nM
EC50/IC50
nM
koff
s-1
kon
M-1s-1
pHTemp
°C
XIAP-BIR3
(Homo sapiens (Human))
BDBM26205
((3S,6S,7R,9aS)-6-[(2S)-2-aminobutanamido]-7-(2-ami...)
Show SMILES CC[C@H](N)C(=O)N[C@H]1[C@@H](CCN)CC[C@H]2CC[C@H](N2C1=O)C(=O)NC(c1ccccc1)c1ccccc1 |r|
Show InChI InChI=1S/C29H39N5O3/c1-2-23(31)27(35)33-26-21(17-18-30)13-14-22-15-16-24(34(22)29(26)37)28(36)32-25(19-9-5-3-6-10-19)20-11-7-4-8-12-20/h3-12,21-26H,2,13-18,30-31H2,1H3,(H,32,36)(H,33,35)/t21-,22+,23+,24+,26+/m1/s1
Reactome pathway
220 -8.98 250n/an/an/an/a7.522
University of Milano
Assay Description
Fluorescence polarization was measured on an Ultra plate reader (Tecan) at excitation and emission wavelengths of 485 and 530 nm, respectively. The e...
J Mol Biol 384: 673-89 (2008)
Article DOI: 10.1016/j.jmb.2008.09.064
BindingDB Entry DOI: 10.7270/Q2NG4NZ8
3D
3D Structure (crystal)
X-linked inhibitor of apoptosis protein (XIAP)
(Homo sapiens (Human))
BDBM26205
((3S,6S,7R,9aS)-6-[(2S)-2-aminobutanamido]-7-(2-ami...)
Show SMILES CC[C@H](N)C(=O)N[C@H]1[C@@H](CCN)CC[C@H]2CC[C@H](N2C1=O)C(=O)NC(c1ccccc1)c1ccccc1 |r|
Show InChI InChI=1S/C29H39N5O3/c1-2-23(31)27(35)33-26-21(17-18-30)13-14-22-15-16-24(34(22)29(26)37)28(36)32-25(19-9-5-3-6-10-19)20-11-7-4-8-12-20/h3-12,21-26H,2,13-18,30-31H2,1H3,(H,32,36)(H,33,35)/t21-,22+,23+,24+,26+/m1/s1
n/an/a 86n/an/an/an/an/an/a
Universita degli Studi di Milano
Assay Description
Fluorescence polarization was measured on an Ultra plate reader (Tecan) at excitation and emission wavelengths of 485 and 530 nm, respectively. The e...
Bioorg Med Chem 17: 5834-56 (2009)
Article DOI: 10.1016/j.bmc.2009.07.009
BindingDB Entry DOI: 10.7270/Q28W3BNV
3D
3D Structure (crystal)
XIAP-BIR3
(Homo sapiens (Human))
BDBM26205
((3S,6S,7R,9aS)-6-[(2S)-2-aminobutanamido]-7-(2-ami...)
Show SMILES CC[C@H](N)C(=O)N[C@H]1[C@@H](CCN)CC[C@H]2CC[C@H](N2C1=O)C(=O)NC(c1ccccc1)c1ccccc1 |r|
Show InChI InChI=1S/C29H39N5O3/c1-2-23(31)27(35)33-26-21(17-18-30)13-14-22-15-16-24(34(22)29(26)37)28(36)32-25(19-9-5-3-6-10-19)20-11-7-4-8-12-20/h3-12,21-26H,2,13-18,30-31H2,1H3,(H,32,36)(H,33,35)/t21-,22+,23+,24+,26+/m1/s1
n/an/a 250n/an/an/an/a7.523
Universita degli Studi di Milano
Assay Description
Fluorescence polarization was measured on an Ultra plate reader (Tecan) at excitation and emission wavelengths of 485 and 530 nm, respectively. The e...
Bioorg Med Chem 17: 5834-56 (2009)
Article DOI: 10.1016/j.bmc.2009.07.009
BindingDB Entry DOI: 10.7270/Q28W3BNV