BDBM26249 N-[2-(3,5-dimethyl-1H-pyrazol-1-yl)-6-[6-(dimethylamino)pyridin-2-yl]pyrimidin-4-yl]acetamide::pyrazolylpyrimidine derivative, 16c
SMILES: CN(C)c1cccc(n1)-c1cc(NC(C)=O)nc(n1)-n1nc(C)cc1C
InChI Key: InChIKey=PZIMFNJQILPVJP-UHFFFAOYSA-N
Data: 2 KI
Activity Spreadsheet -- Enzyme Inhibition Constant Data from BindingDB
Found 2 hits for monomerid = 26249
Trg + Lig
Ki
nM
ΔG°
kcal/mole
IC50
nM
Kd
nM
EC50/IC50
nM
koff
s-1
kon
M-1s-1
pHTemp
°C
Adenosine receptor A2a
(Homo sapiens (Human))
BDBM26249
(N-[2-(3,5-dimethyl-1H-pyrazol-1-yl)-6-[6-(dimethyl...)
Show SMILES CN(C)c1cccc(n1)-c1cc(NC(C)=O)nc(n1)-n1nc(C)cc1C
Show InChI InChI=1S/C18H21N7O/c1-11-9-12(2)25(23-11)18-21-15(10-16(22-18)19-13(3)26)14-7-6-8-17(20-14)24(4)5/h6-10H,1-5H3,(H,19,21,22,26)
NCI pathway
Reactome pathway
0.610 -12.4n/an/an/an/an/a7.422
Neurocrine Bioscience
Assay Description
The membranes prepared from HEK cells transfected with adenosine receptors were used in binding assays. Nonspecific binding was determined in the pre...
J Med Chem 51: 7099-7110 (2008)
Article DOI: 10.1021/jm800851u
BindingDB Entry DOI: 10.7270/Q20R9MQG
Adenosine receptor A1
(Homo sapiens (Human))
BDBM26249
(N-[2-(3,5-dimethyl-1H-pyrazol-1-yl)-6-[6-(dimethyl...)
Show SMILES CN(C)c1cccc(n1)-c1cc(NC(C)=O)nc(n1)-n1nc(C)cc1C
Show InChI InChI=1S/C18H21N7O/c1-11-9-12(2)25(23-11)18-21-15(10-16(22-18)19-13(3)26)14-7-6-8-17(20-14)24(4)5/h6-10H,1-5H3,(H,19,21,22,26)
Reactome pathway
81n/an/an/an/an/an/an/an/a
Neurocrine Bioscience
Assay Description
The membranes prepared from HEK cells transfected with adenosine receptors were used in binding assays. Nonspecific binding was determined in the pre...
J Med Chem 51: 7099-7110 (2008)
Article DOI: 10.1021/jm800851u
BindingDB Entry DOI: 10.7270/Q20R9MQG