BDBM262571 3-(2-amino-1,3-benzothiazol-4-yl)-2-(2H-tetrazol-5-yl)-6-(trifluoromethyl)benzenesulfonamide::US9708336, 423::US9708336, 561
SMILES: Nc1nc2c(cccc2s1)-c1ccc(c(c1-c1nnn[nH]1)S(N)(=O)=O)C(F)(F)F
InChI Key: InChIKey=UKIORIWISGQFSR-UHFFFAOYSA-N
Data: 6 IC50
Activity Spreadsheet -- Enzyme Inhibition Constant Data from BindingDB
Found 6 hits for monomerid = 262571
Trg + Lig
Ki
nM
ΔG°
kcal/mole
IC50
nM
Kd
nM
EC50/IC50
nM
koff
s-1
kon
M-1s-1
pHTemp
°C
Metallo-beta-lactamase type 2
(Serratia marcescens)
BDBM262571
(3-(2-amino-1,3-benzothiazol-4-yl)-2-(2H-tetrazol-5...)
Show SMILES Nc1nc2c(cccc2s1)-c1ccc(c(c1-c1nnn[nH]1)S(N)(=O)=O)C(F)(F)F
Show InChI InChI=1S/C15H10F3N7O2S2/c16-15(17,18)8-5-4-6(7-2-1-3-9-11(7)21-14(19)28-9)10(12(8)29(20,26)27)13-22-24-25-23-13/h1-5H,(H2,19,21)(H2,20,26,27)(H,22,23,24,25)
US Patent
n/an/a 1.29n/an/an/an/a7.0n/a
Merck Sharp & Dohme Corp.
US Patent
Assay Description
The Class B enzyme activities were measured in the presence of the test inhibitor in a fluorescence assay against a commercially available substrate ...
US Patent US9708336 (2017)
BindingDB Entry DOI: 10.7270/Q2FN186K
Beta-lactamase NDM-1
(Klebsiella pneumoniae)
BDBM262571
(3-(2-amino-1,3-benzothiazol-4-yl)-2-(2H-tetrazol-5...)
Show SMILES Nc1nc2c(cccc2s1)-c1ccc(c(c1-c1nnn[nH]1)S(N)(=O)=O)C(F)(F)F
Show InChI InChI=1S/C15H10F3N7O2S2/c16-15(17,18)8-5-4-6(7-2-1-3-9-11(7)21-14(19)28-9)10(12(8)29(20,26)27)13-22-24-25-23-13/h1-5H,(H2,19,21)(H2,20,26,27)(H,22,23,24,25)
US Patent
n/an/a 0.378n/an/an/an/a7.0n/a
Merck Sharp & Dohme Corp.
US Patent
Assay Description
The Class B enzyme activities were measured in the presence of the test inhibitor in a fluorescence assay against a commercially available substrate ...
US Patent US9708336 (2017)
BindingDB Entry DOI: 10.7270/Q2FN186K
Beta-lactamase VIM-1
(Klebsiella pneumoniae)
BDBM262571
(3-(2-amino-1,3-benzothiazol-4-yl)-2-(2H-tetrazol-5...)
Show SMILES Nc1nc2c(cccc2s1)-c1ccc(c(c1-c1nnn[nH]1)S(N)(=O)=O)C(F)(F)F
Show InChI InChI=1S/C15H10F3N7O2S2/c16-15(17,18)8-5-4-6(7-2-1-3-9-11(7)21-14(19)28-9)10(12(8)29(20,26)27)13-22-24-25-23-13/h1-5H,(H2,19,21)(H2,20,26,27)(H,22,23,24,25)
US Patent
n/an/a 0.434n/an/an/an/a7.0n/a
Merck Sharp & Dohme Corp.
US Patent
Assay Description
The Class B enzyme activities were measured in the presence of the test inhibitor in a fluorescence assay against a commercially available substrate ...
US Patent US9708336 (2017)
BindingDB Entry DOI: 10.7270/Q2FN186K
Metallo-beta-lactamase type 2
(Serratia marcescens)
BDBM262571
(3-(2-amino-1,3-benzothiazol-4-yl)-2-(2H-tetrazol-5...)
Show SMILES Nc1nc2c(cccc2s1)-c1ccc(c(c1-c1nnn[nH]1)S(N)(=O)=O)C(F)(F)F
Show InChI InChI=1S/C15H10F3N7O2S2/c16-15(17,18)8-5-4-6(7-2-1-3-9-11(7)21-14(19)28-9)10(12(8)29(20,26)27)13-22-24-25-23-13/h1-5H,(H2,19,21)(H2,20,26,27)(H,22,23,24,25)
US Patent
n/an/a 0.993n/an/an/an/a7.0n/a
Merck Sharp & Dohme Corp.
US Patent
Assay Description
The Class B enzyme activities were measured in the presence of the test inhibitor in a fluorescence assay against a commercially available substrate ...
US Patent US9708336 (2017)
BindingDB Entry DOI: 10.7270/Q2FN186K
Beta-lactamase NDM-1
(Klebsiella pneumoniae)
BDBM262571
(3-(2-amino-1,3-benzothiazol-4-yl)-2-(2H-tetrazol-5...)
Show SMILES Nc1nc2c(cccc2s1)-c1ccc(c(c1-c1nnn[nH]1)S(N)(=O)=O)C(F)(F)F
Show InChI InChI=1S/C15H10F3N7O2S2/c16-15(17,18)8-5-4-6(7-2-1-3-9-11(7)21-14(19)28-9)10(12(8)29(20,26)27)13-22-24-25-23-13/h1-5H,(H2,19,21)(H2,20,26,27)(H,22,23,24,25)
US Patent
n/an/a 0.153n/an/an/an/a7.0n/a
Merck Sharp & Dohme Corp.
US Patent
Assay Description
The Class B enzyme activities were measured in the presence of the test inhibitor in a fluorescence assay against a commercially available substrate ...
US Patent US9708336 (2017)
BindingDB Entry DOI: 10.7270/Q2FN186K
Beta-lactamase VIM-1
(Klebsiella pneumoniae)
BDBM262571
(3-(2-amino-1,3-benzothiazol-4-yl)-2-(2H-tetrazol-5...)
Show SMILES Nc1nc2c(cccc2s1)-c1ccc(c(c1-c1nnn[nH]1)S(N)(=O)=O)C(F)(F)F
Show InChI InChI=1S/C15H10F3N7O2S2/c16-15(17,18)8-5-4-6(7-2-1-3-9-11(7)21-14(19)28-9)10(12(8)29(20,26)27)13-22-24-25-23-13/h1-5H,(H2,19,21)(H2,20,26,27)(H,22,23,24,25)
US Patent
n/an/a 0.711n/an/an/an/a7.0n/a
Merck Sharp & Dohme Corp.
US Patent
Assay Description
The Class B enzyme activities were measured in the presence of the test inhibitor in a fluorescence assay against a commercially available substrate ...
US Patent US9708336 (2017)
BindingDB Entry DOI: 10.7270/Q2FN186K