BDBM262634 3-(Quinolin-5-yl)-2-(2H-tetrazol-5-yl)-6-(trifluoromethyl)benzenesulfonamide::US9708336, 486
SMILES: NS(=O)(=O)c1c(ccc(-c2cccc3ncccc23)c1-c1nn[nH]n1)C(F)(F)F
InChI Key: InChIKey=DMGNHLTVWFZHMF-UHFFFAOYSA-N
Data: 3 IC50
Activity Spreadsheet -- Enzyme Inhibition Constant Data from BindingDB
Found 3 hits for monomerid = 262634
Trg + Lig
Ki
nM
ΔG°
kcal/mole
IC50
nM
Kd
nM
EC50/IC50
nM
koff
s-1
kon
M-1s-1
pHTemp
°C
Metallo-beta-lactamase type 2
(Serratia marcescens)
BDBM262634
(3-(Quinolin-5-yl)-2-(2H-tetrazol-5-yl)-6-(trifluor...)
Show SMILES NS(=O)(=O)c1c(ccc(-c2cccc3ncccc23)c1-c1nn[nH]n1)C(F)(F)F
Show InChI InChI=1S/C17H11F3N6O2S/c18-17(19,20)12-7-6-11(9-3-1-5-13-10(9)4-2-8-22-13)14(15(12)29(21,27)28)16-23-25-26-24-16/h1-8H,(H2,21,27,28)(H,23,24,25,26)
US Patent
n/an/a 1.19n/an/an/an/a7.0n/a
Merck Sharp & Dohme Corp.
US Patent
Assay Description
The Class B enzyme activities were measured in the presence of the test inhibitor in a fluorescence assay against a commercially available substrate ...
US Patent US9708336 (2017)
BindingDB Entry DOI: 10.7270/Q2FN186K
Beta-lactamase VIM-1
(Klebsiella pneumoniae)
BDBM262634
(3-(Quinolin-5-yl)-2-(2H-tetrazol-5-yl)-6-(trifluor...)
Show SMILES NS(=O)(=O)c1c(ccc(-c2cccc3ncccc23)c1-c1nn[nH]n1)C(F)(F)F
Show InChI InChI=1S/C17H11F3N6O2S/c18-17(19,20)12-7-6-11(9-3-1-5-13-10(9)4-2-8-22-13)14(15(12)29(21,27)28)16-23-25-26-24-16/h1-8H,(H2,21,27,28)(H,23,24,25,26)
US Patent
n/an/a 0.134n/an/an/an/a7.0n/a
Merck Sharp & Dohme Corp.
US Patent
Assay Description
The Class B enzyme activities were measured in the presence of the test inhibitor in a fluorescence assay against a commercially available substrate ...
US Patent US9708336 (2017)
BindingDB Entry DOI: 10.7270/Q2FN186K
Beta-lactamase NDM-1
(Klebsiella pneumoniae)
BDBM262634
(3-(Quinolin-5-yl)-2-(2H-tetrazol-5-yl)-6-(trifluor...)
Show SMILES NS(=O)(=O)c1c(ccc(-c2cccc3ncccc23)c1-c1nn[nH]n1)C(F)(F)F
Show InChI InChI=1S/C17H11F3N6O2S/c18-17(19,20)12-7-6-11(9-3-1-5-13-10(9)4-2-8-22-13)14(15(12)29(21,27)28)16-23-25-26-24-16/h1-8H,(H2,21,27,28)(H,23,24,25,26)
US Patent
n/an/a 0.192n/an/an/an/a7.0n/a
Merck Sharp & Dohme Corp.
US Patent
Assay Description
The Class B enzyme activities were measured in the presence of the test inhibitor in a fluorescence assay against a commercially available substrate ...
US Patent US9708336 (2017)
BindingDB Entry DOI: 10.7270/Q2FN186K