BDBM26290 N-(3-fluorophenyl)-2-{3-[(7-{3-[(2-hydroxyethyl)amino]propoxy}-6-methoxyquinazolin-4-yl)amino]-1H-pyrazol-5-yl}acetamide::pyrazoloquinazoline deriv., 24
SMILES: COc1cc2c(Nc3cc(CC(=O)Nc4cccc(F)c4)n[nH]3)ncnc2cc1OCCCNCCO
InChI Key: InChIKey=KSAUSYLGKMZHPT-UHFFFAOYSA-N
Data: 2 KI
Activity Spreadsheet -- Enzyme Inhibition Constant Data from BindingDB
Found 2 hits for monomerid = 26290
Trg + Lig
Ki
nM
ΔG°
kcal/mole
IC50
nM
Kd
nM
EC50/IC50
nM
koff
s-1
kon
M-1s-1
pHTemp
°C
Aurora kinase B
(Homo sapiens (Human))
BDBM26290
(N-(3-fluorophenyl)-2-{3-[(7-{3-[(2-hydroxyethyl)am...)
Show SMILES COc1cc2c(Nc3cc(CC(=O)Nc4cccc(F)c4)n[nH]3)ncnc2cc1OCCCNCCO
Show InChI InChI=1S/C25H28FN7O4/c1-36-21-13-19-20(14-22(21)37-9-3-6-27-7-8-34)28-15-29-25(19)31-23-11-18(32-33-23)12-24(35)30-17-5-2-4-16(26)10-17/h2,4-5,10-11,13-15,27,34H,3,6-9,12H2,1H3,(H,30,35)(H2,28,29,31,32,33)
Reactome pathway
1 -12.1n/an/an/an/an/a7.522
AstraZeneca
Assay Description
In vitro kinase assay using recombinant Aurora B bound to INCENP was incubated at room temperature with substrate, and test compounds in the presence...
J Med Chem 50: 2213-24 (2007)
Article DOI: 10.1021/jm061335f
BindingDB Entry DOI: 10.7270/Q2GQ6W24
Aurora kinase A
(Homo sapiens (Human))
BDBM26290
(N-(3-fluorophenyl)-2-{3-[(7-{3-[(2-hydroxyethyl)am...)
Show SMILES COc1cc2c(Nc3cc(CC(=O)Nc4cccc(F)c4)n[nH]3)ncnc2cc1OCCCNCCO
Show InChI InChI=1S/C25H28FN7O4/c1-36-21-13-19-20(14-22(21)37-9-3-6-27-7-8-34)28-15-29-25(19)31-23-11-18(32-33-23)12-24(35)30-17-5-2-4-16(26)10-17/h2,4-5,10-11,13-15,27,34H,3,6-9,12H2,1H3,(H,30,35)(H2,28,29,31,32,33)
NCI pathway
Reactome pathway
690 -8.40n/an/an/an/an/an/a25
AstraZeneca
Assay Description
In vitro kinase assay using recombinant Aurora A purified from Sf9 cells was incubated at room temperature with substrate, and test compounds in the ...
J Med Chem 50: 2213-24 (2007)
Article DOI: 10.1021/jm061335f
BindingDB Entry DOI: 10.7270/Q2GQ6W24