null
SMILES: NS(=O)(=O)c1c(ccc(-c2ccc(cc2)C2CCN(CC2)C2CC3CCC2N3)c1-c1nnn[nH]1)C(F)(F)F
InChI Key:
Activity Spreadsheet -- Enzyme Inhibition Constant Data from BindingDB
Found 3 hits for monomerid = 262935
Trg + Lig
Ki
nM
ΔG°
kcal/mole
IC50
nM
Kd
nM
EC50/IC50
nM
koff
s-1
kon
M-1s-1
pHTemp
°C
Metallo-beta-lactamase type 2
(Serratia marcescens)
BDBM262935
(4'-[1-(7- azabicyclo[2.2.1]hept-2- yl)piperidin-4-...)
Show SMILES NS(=O)(=O)c1c(ccc(-c2ccc(cc2)C2CCN(CC2)C2CC3CCC2N3)c1-c1nnn[nH]1)C(F)(F)F
US Patent
n/an/a 0.438n/an/an/an/a7.0n/a
Merck Sharp & Dohme Corp.
US Patent
Assay Description
The Class B enzyme activities were measured in the presence of the test inhibitor in a fluorescence assay against a commercially available substrate ...
US Patent US9708336 (2017)
BindingDB Entry DOI: 10.7270/Q2FN186K
VIM-1 metallo-beta-lactamase
(Klebsiella pneumoniae)
BDBM262935
(4'-[1-(7- azabicyclo[2.2.1]hept-2- yl)piperidin-4-...)
Show SMILES NS(=O)(=O)c1c(ccc(-c2ccc(cc2)C2CCN(CC2)C2CC3CCC2N3)c1-c1nnn[nH]1)C(F)(F)F
US Patent
n/an/a 35.6n/an/an/an/a7.0n/a
Merck Sharp & Dohme Corp.
US Patent
Assay Description
The Class B enzyme activities were measured in the presence of the test inhibitor in a fluorescence assay against a commercially available substrate ...
US Patent US9708336 (2017)
BindingDB Entry DOI: 10.7270/Q2FN186K
Metallo-beta-lactamase type 2
(Klebsiella pneumoniae)
BDBM262935
(4'-[1-(7- azabicyclo[2.2.1]hept-2- yl)piperidin-4-...)
Show SMILES NS(=O)(=O)c1c(ccc(-c2ccc(cc2)C2CCN(CC2)C2CC3CCC2N3)c1-c1nnn[nH]1)C(F)(F)F
US Patent
n/an/a 2.83n/an/an/an/a7.0n/a
Merck Sharp & Dohme Corp.
US Patent
Assay Description
The Class B enzyme activities were measured in the presence of the test inhibitor in a fluorescence assay against a commercially available substrate ...
US Patent US9708336 (2017)
BindingDB Entry DOI: 10.7270/Q2FN186K