BDBM263224 3-isopropyl-1-[4-(4-methyl-pyrazol-1-ylmethyl)-benzyl]-1h-pyrazole-4-carboxylic acid (1-amino-isoquinolin-6-ylmethyl)-amide::US9533987, example 13
SMILES: CC(C)c1nn(Cc2ccc(Cn3cc(C)cn3)cc2)cc1C(=O)NCc1ccc2c(N)nccc2c1
InChI Key: InChIKey=URCKKASOEPCAIT-UHFFFAOYSA-N
Data: 2 IC50
Activity Spreadsheet -- Enzyme Inhibition Constant Data from BindingDB
Found 2 hits for monomerid = 263224
Trg + Lig
Ki
nM
ΔG°
kcal/mole
IC50
nM
Kd
nM
EC50/IC50
nM
koff
s-1
kon
M-1s-1
pHTemp
°C
Kallikrein 1
(Homo sapiens (Human))
BDBM263224
(3-isopropyl-1-[4-(4-methyl-pyrazol-1-ylmethyl)-ben...)
Show SMILES CC(C)c1nn(Cc2ccc(Cn3cc(C)cn3)cc2)cc1C(=O)NCc1ccc2c(N)nccc2c1
Show InChI InChI=1S/C29H31N7O/c1-19(2)27-26(29(37)32-14-23-8-9-25-24(12-23)10-11-31-28(25)30)18-36(34-27)17-22-6-4-21(5-7-22)16-35-15-20(3)13-33-35/h4-13,15,18-19H,14,16-17H2,1-3H3,(H2,30,31)(H,32,37)
US Patent
n/an/a 5.16E+3n/an/an/an/an/an/a
Kalvista Pharmaceuticals Limited
US Patent
Assay Description
Human serine protease enzymes plasmin, thrombin, trypsin, Factor Xa and Factor XIIa were assayed for enzymatic activity using an appropriate fluoroge...
US Patent US9533987 (2017)
BindingDB Entry DOI: 10.7270/Q2SX6G78
Plasma kallikrein
(Homo sapiens (Human))
BDBM263224
(3-isopropyl-1-[4-(4-methyl-pyrazol-1-ylmethyl)-ben...)
Show SMILES CC(C)c1nn(Cc2ccc(Cn3cc(C)cn3)cc2)cc1C(=O)NCc1ccc2c(N)nccc2c1
Show InChI InChI=1S/C29H31N7O/c1-19(2)27-26(29(37)32-14-23-8-9-25-24(12-23)10-11-31-28(25)30)18-36(34-27)17-22-6-4-21(5-7-22)16-35-15-20(3)13-33-35/h4-13,15,18-19H,14,16-17H2,1-3H3,(H2,30,31)(H,32,37)
US Patent
n/an/a 2.14n/an/an/an/an/an/a
Kalvista Pharmaceuticals Limited
US Patent
Assay Description
Plasma kallikrein inhibitory activity in vitro was determined using standard published methods (see e.g. Johansen et al., Int. J. Tiss. Reac. 1986, 8...
US Patent US9533987 (2017)
BindingDB Entry DOI: 10.7270/Q2SX6G78