BDBM26325 1-(3-fluorophenyl)-3-[5-(2-{thieno[3,2-d]pyrimidin-4-ylamino}ethyl)-1,3-thiazol-2-yl]urea::thieno[3,2-d]pyrimidine analogue, 20
SMILES: Fc1cccc(NC(=O)Nc2ncc(CCNc3ncnc4ccsc34)s2)c1
InChI Key: InChIKey=MEWSLTZRULAUFE-UHFFFAOYSA-N
Data: 2 IC50
Activity Spreadsheet -- Enzyme Inhibition Constant Data from BindingDB
Found 2 hits for monomerid = 26325
Trg + Lig
Ki
nM
ΔG°
kcal/mole
IC50
nM
Kd
nM
EC50/IC50
nM
koff
s-1
kon
M-1s-1
pHTemp
°C
Aurora kinase B
(Homo sapiens (Human))
BDBM26325
(1-(3-fluorophenyl)-3-[5-(2-{thieno[3,2-d]pyrimidin...)
Show SMILES Fc1cccc(NC(=O)Nc2ncc(CCNc3ncnc4ccsc34)s2)c1
Show InChI InChI=1S/C18H15FN6OS2/c19-11-2-1-3-12(8-11)24-17(26)25-18-21-9-13(28-18)4-6-20-16-15-14(5-7-27-15)22-10-23-16/h1-3,5,7-10H,4,6H2,(H,20,22,23)(H2,21,24,25,26)
Reactome pathway
n/an/a 18n/an/an/an/an/an/a
Sunesis Pharmaceuticals
Assay Description
Compounds were diluted into assay buffer containing Aurora kinase and FAM-PKAtide. The kinase reaction was initiated by adding ATP in assay buffer. T...
Bioorg Med Chem Lett 18: 4880-4 (2008)
Article DOI: 10.1016/j.bmcl.2008.07.073
BindingDB Entry DOI: 10.7270/Q279430N
Aurora Kinase A (Aurora-A)
(Mus musculus (mouse))
BDBM26325
(1-(3-fluorophenyl)-3-[5-(2-{thieno[3,2-d]pyrimidin...)
Show SMILES Fc1cccc(NC(=O)Nc2ncc(CCNc3ncnc4ccsc34)s2)c1
Show InChI InChI=1S/C18H15FN6OS2/c19-11-2-1-3-12(8-11)24-17(26)25-18-21-9-13(28-18)4-6-20-16-15-14(5-7-27-15)22-10-23-16/h1-3,5,7-10H,4,6H2,(H,20,22,23)(H2,21,24,25,26)
Reactome pathway
n/an/a 23n/an/an/an/a7.221
Sunesis Pharmaceuticals
Assay Description
Compounds were diluted into assay buffer containing Aurora kinase and FAM-PKAtide. The kinase reaction was initiated by adding ATP in assay buffer. T...
Bioorg Med Chem Lett 18: 4880-4 (2008)
Article DOI: 10.1016/j.bmcl.2008.07.073
BindingDB Entry DOI: 10.7270/Q279430N