BDBM26328 1-(2-chlorophenyl)-3-[5-(2-{thieno[3,2-d]pyrimidin-4-ylamino}ethyl)-1,3-thiazol-2-yl]urea::thieno[3,2-d]pyrimidine analogue, 23
SMILES: Clc1ccccc1NC(=O)Nc1ncc(CCNc2ncnc3ccsc23)s1
InChI Key: InChIKey=KFDNXYGJOPWMGB-UHFFFAOYSA-N
Data: 1 IC50
Activity Spreadsheet -- Enzyme Inhibition Constant Data from BindingDB
Found 1 hit for monomerid = 26328
Trg + Lig
Ki
nM
ΔG°
kcal/mole
IC50
nM
Kd
nM
EC50/IC50
nM
koff
s-1
kon
M-1s-1
pHTemp
°C
Aurora Kinase A (Aurora-A)
(Mus musculus (mouse))
BDBM26328
(1-(2-chlorophenyl)-3-[5-(2-{thieno[3,2-d]pyrimidin...)
Show SMILES Clc1ccccc1NC(=O)Nc1ncc(CCNc2ncnc3ccsc23)s1
Show InChI InChI=1S/C18H15ClN6OS2/c19-12-3-1-2-4-13(12)24-17(26)25-18-21-9-11(28-18)5-7-20-16-15-14(6-8-27-15)22-10-23-16/h1-4,6,8-10H,5,7H2,(H,20,22,23)(H2,21,24,25,26)
Reactome pathway
n/an/a 280n/an/an/an/a7.221
Sunesis Pharmaceuticals
Assay Description
Compounds were diluted into assay buffer containing Aurora kinase and FAM-PKAtide. The kinase reaction was initiated by adding ATP in assay buffer. T...
Bioorg Med Chem Lett 18: 4880-4 (2008)
Article DOI: 10.1016/j.bmcl.2008.07.073
BindingDB Entry DOI: 10.7270/Q279430N