BDBM26331 1-1H-indol-7-yl-3-[5-(2-{thieno[3,2-d]pyrimidin-4-ylamino}ethyl)-1,3-thiazol-2-yl]urea::thieno[3,2-d]pyrimidine analogue, 26
SMILES: O=C(Nc1ncc(CCNc2ncnc3ccsc23)s1)Nc1cccc2cc[nH]c12
InChI Key: InChIKey=UNXQVAHMAHJXJM-UHFFFAOYSA-N
Data: 2 IC50
Activity Spreadsheet -- Enzyme Inhibition Constant Data from BindingDB
Found 2 hits for monomerid = 26331
Trg + Lig
Ki
nM
ΔG°
kcal/mole
IC50
nM
Kd
nM
EC50/IC50
nM
koff
s-1
kon
M-1s-1
pHTemp
°C
Aurora kinase B
(Homo sapiens (Human))
BDBM26331
(1-1H-indol-7-yl-3-[5-(2-{thieno[3,2-d]pyrimidin-4-...)
Show SMILES O=C(Nc1ncc(CCNc2ncnc3ccsc23)s1)Nc1cccc2cc[nH]c12
Show InChI InChI=1S/C20H17N7OS2/c28-19(26-14-3-1-2-12-4-7-21-16(12)14)27-20-23-10-13(30-20)5-8-22-18-17-15(6-9-29-17)24-11-25-18/h1-4,6-7,9-11,21H,5,8H2,(H,22,24,25)(H2,23,26,27,28)
Reactome pathway
n/an/a 19n/an/an/an/an/an/a
Sunesis Pharmaceuticals
Assay Description
Compounds were diluted into assay buffer containing Aurora kinase and FAM-PKAtide. The kinase reaction was initiated by adding ATP in assay buffer. T...
Bioorg Med Chem Lett 18: 4880-4 (2008)
Article DOI: 10.1016/j.bmcl.2008.07.073
BindingDB Entry DOI: 10.7270/Q279430N
Aurora Kinase A (Aurora-A)
(Mus musculus (mouse))
BDBM26331
(1-1H-indol-7-yl-3-[5-(2-{thieno[3,2-d]pyrimidin-4-...)
Show SMILES O=C(Nc1ncc(CCNc2ncnc3ccsc23)s1)Nc1cccc2cc[nH]c12
Show InChI InChI=1S/C20H17N7OS2/c28-19(26-14-3-1-2-12-4-7-21-16(12)14)27-20-23-10-13(30-20)5-8-22-18-17-15(6-9-29-17)24-11-25-18/h1-4,6-7,9-11,21H,5,8H2,(H,22,24,25)(H2,23,26,27,28)
Reactome pathway
n/an/a 30n/an/an/an/a7.221
Sunesis Pharmaceuticals
Assay Description
Compounds were diluted into assay buffer containing Aurora kinase and FAM-PKAtide. The kinase reaction was initiated by adding ATP in assay buffer. T...
Bioorg Med Chem Lett 18: 4880-4 (2008)
Article DOI: 10.1016/j.bmcl.2008.07.073
BindingDB Entry DOI: 10.7270/Q279430N