BDBM26333 1-[3-(pyrrolidin-1-ylmethyl)-5-(trifluoromethyl)phenyl]-3-[5-(2-{thieno[3,2-d]pyrimidin-4-ylamino}ethyl)-1,3-thiazol-2-yl]urea::thieno[3,2-d]pyrimidine analogue, 28
SMILES: FC(F)(F)c1cc(CN2CCCC2)cc(NC(=O)Nc2ncc(CCNc3ncnc4ccsc34)s2)c1
InChI Key: InChIKey=YXEIECLOAMHVCH-UHFFFAOYSA-N
Data: 2 IC50
Activity Spreadsheet -- Enzyme Inhibition Constant Data from BindingDB
Found 2 hits for monomerid = 26333
Trg + Lig
Ki
nM
ΔG°
kcal/mole
IC50
nM
Kd
nM
EC50/IC50
nM
koff
s-1
kon
M-1s-1
pHTemp
°C
Aurora kinase B
(Homo sapiens (Human))
BDBM26333
(1-[3-(pyrrolidin-1-ylmethyl)-5-(trifluoromethyl)ph...)
Show SMILES FC(F)(F)c1cc(CN2CCCC2)cc(NC(=O)Nc2ncc(CCNc3ncnc4ccsc34)s2)c1
Show InChI InChI=1S/C24H24F3N7OS2/c25-24(26,27)16-9-15(13-34-6-1-2-7-34)10-17(11-16)32-22(35)33-23-29-12-18(37-23)3-5-28-21-20-19(4-8-36-20)30-14-31-21/h4,8-12,14H,1-3,5-7,13H2,(H,28,30,31)(H2,29,32,33,35)
Reactome pathway
n/an/a 22n/an/an/an/an/an/a
Sunesis Pharmaceuticals
Assay Description
Compounds were diluted into assay buffer containing Aurora kinase and FAM-PKAtide. The kinase reaction was initiated by adding ATP in assay buffer. T...
Bioorg Med Chem Lett 18: 4880-4 (2008)
Article DOI: 10.1016/j.bmcl.2008.07.073
BindingDB Entry DOI: 10.7270/Q279430N
Aurora Kinase A (Aurora-A)
(Mus musculus (mouse))
BDBM26333
(1-[3-(pyrrolidin-1-ylmethyl)-5-(trifluoromethyl)ph...)
Show SMILES FC(F)(F)c1cc(CN2CCCC2)cc(NC(=O)Nc2ncc(CCNc3ncnc4ccsc34)s2)c1
Show InChI InChI=1S/C24H24F3N7OS2/c25-24(26,27)16-9-15(13-34-6-1-2-7-34)10-17(11-16)32-22(35)33-23-29-12-18(37-23)3-5-28-21-20-19(4-8-36-20)30-14-31-21/h4,8-12,14H,1-3,5-7,13H2,(H,28,30,31)(H2,29,32,33,35)
Reactome pathway
n/an/a 4n/an/an/an/a7.221
Sunesis Pharmaceuticals
Assay Description
Compounds were diluted into assay buffer containing Aurora kinase and FAM-PKAtide. The kinase reaction was initiated by adding ATP in assay buffer. T...
Bioorg Med Chem Lett 18: 4880-4 (2008)
Article DOI: 10.1016/j.bmcl.2008.07.073
BindingDB Entry DOI: 10.7270/Q279430N