BDBM263361 US9546162, 19
SMILES: COc1cc(CO)cc(c1)S(=O)(=O)N1CCc2cccc(CCc3ccc(cc3)C(O)=O)c12
InChI Key: InChIKey=GNQFVWHBHKWCJW-UHFFFAOYSA-N
Data: 4 KI  3 EC50
Activity Spreadsheet -- Enzyme Inhibition Constant Data from BindingDB
Found 4 hits for monomerid = 263361
Trg + Lig
Ki
nM
ΔG°
kcal/mole
IC50
nM
Kd
nM
EC50/IC50
nM
koff
s-1
kon
M-1s-1
pHTemp
°C
Prostaglandin E2 receptor EP4 subtype
(Homo sapiens (Human))
BDBM263361
(US9546162, 19)
Show SMILES COc1cc(CO)cc(c1)S(=O)(=O)N1CCc2cccc(CCc3ccc(cc3)C(O)=O)c12
Show InChI InChI=1S/C25H25NO6S/c1-32-22-13-18(16-27)14-23(15-22)33(30,31)26-12-11-20-4-2-3-19(24(20)26)8-5-17-6-9-21(10-7-17)25(28)29/h2-4,6-7,9-10,13-15,27H,5,8,11-12,16H2,1H3,(H,28,29)
Reactome pathway
US Patent
0.400n/an/an/a 2n/an/a7.4n/a
ALLERGAN, INC.
US Patent
Assay Description
HEK-293 cells stably expressing the human or feline FP receptor, or EP1, EP2, or EP4 receptors were washed with TME buffer, scraped from the bottom o...
US Patent US9546162 (2017)
BindingDB Entry DOI: 10.7270/Q2P55QHV
Prostaglandin E2 receptor EP2 subtype
(Homo sapiens (Human))
BDBM263361
(US9546162, 19)
Show SMILES COc1cc(CO)cc(c1)S(=O)(=O)N1CCc2cccc(CCc3ccc(cc3)C(O)=O)c12
Show InChI InChI=1S/C25H25NO6S/c1-32-22-13-18(16-27)14-23(15-22)33(30,31)26-12-11-20-4-2-3-19(24(20)26)8-5-17-6-9-21(10-7-17)25(28)29/h2-4,6-7,9-10,13-15,27H,5,8,11-12,16H2,1H3,(H,28,29)
Reactome pathway
US Patent
18n/an/an/a 36n/an/a7.4n/a
ALLERGAN, INC.
US Patent
Assay Description
HEK-293 cells stably expressing the human or feline FP receptor, or EP1, EP2, or EP4 receptors were washed with TME buffer, scraped from the bottom o...
US Patent US9546162 (2017)
BindingDB Entry DOI: 10.7270/Q2P55QHV
Prostaglandin E2 receptor EP2 subtype
(Homo sapiens (Human))
BDBM263361
(US9546162, 19)
Show SMILES COc1cc(CO)cc(c1)S(=O)(=O)N1CCc2cccc(CCc3ccc(cc3)C(O)=O)c12
Show InChI InChI=1S/C25H25NO6S/c1-32-22-13-18(16-27)14-23(15-22)33(30,31)26-12-11-20-4-2-3-19(24(20)26)8-5-17-6-9-21(10-7-17)25(28)29/h2-4,6-7,9-10,13-15,27H,5,8,11-12,16H2,1H3,(H,28,29)
Reactome pathway
US Patent
776n/an/an/an/an/an/a7.4n/a
ALLERGAN, INC.
US Patent
Assay Description
Cells were seeded at a density of 5×104 cells per well in Biocoat® Poly-D-lysine-coated black-wall, clear-bottom 96-well plates (Becton-Dickinson) an...
US Patent US9546162 (2017)
BindingDB Entry DOI: 10.7270/Q2P55QHV
Prostaglandin E2 receptor EP4 subtype
(Homo sapiens (Human))
BDBM263361
(US9546162, 19)
Show SMILES COc1cc(CO)cc(c1)S(=O)(=O)N1CCc2cccc(CCc3ccc(cc3)C(O)=O)c12
Show InChI InChI=1S/C25H25NO6S/c1-32-22-13-18(16-27)14-23(15-22)33(30,31)26-12-11-20-4-2-3-19(24(20)26)8-5-17-6-9-21(10-7-17)25(28)29/h2-4,6-7,9-10,13-15,27H,5,8,11-12,16H2,1H3,(H,28,29)
Reactome pathway
US Patent
8.23E+3n/an/an/a>1.00E+4n/an/a7.4n/a
ALLERGAN, INC.
US Patent
Assay Description
Cells were seeded at a density of 5×104 cells per well in Biocoat® Poly-D-lysine-coated black-wall, clear-bottom 96-well plates (Becton-Dickinson) an...
US Patent US9546162 (2017)
BindingDB Entry DOI: 10.7270/Q2P55QHV