BDBM26367 Aminoquinazoline amide, 35::N-[3-(2-aminoquinazolin-6-yl)-4-methylphenyl]-3-(trifluoromethyl)benzamide
SMILES: Cc1ccc(NC(=O)c2cccc(c2)C(F)(F)F)cc1-c1ccc2nc(N)ncc2c1
InChI Key: InChIKey=SLDNXLAQRVJNJO-UHFFFAOYSA-N
Data: 5 IC50
Activity Spreadsheet -- Enzyme Inhibition Constant Data from BindingDB
Found 5 hits for monomerid = 26367
Trg + Lig
Ki
nM
ΔG°
kcal/mole
IC50
nM
Kd
nM
EC50/IC50
nM
koff
s-1
kon
M-1s-1
pHTemp
°C
Tyrosine-protein kinase Lck
(Homo sapiens (Human))
BDBM26367
(Aminoquinazoline amide, 35 | N-[3-(2-aminoquinazol...)
Show SMILES Cc1ccc(NC(=O)c2cccc(c2)C(F)(F)F)cc1-c1ccc2nc(N)ncc2c1
Show InChI InChI=1S/C23H17F3N4O/c1-13-5-7-18(29-21(31)15-3-2-4-17(10-15)23(24,25)26)11-19(13)14-6-8-20-16(9-14)12-28-22(27)30-20/h2-12H,1H3,(H,29,31)(H2,27,28,30)
n/an/a 0.400n/an/an/an/a7.522
Amgen
Assay Description
The assay involves the phosphorylation of a biotinylated substrate and the detection of this phosphorylation after the addition of a streptavidin-all...
J Med Chem 51: 1681-94 (2008)
Article DOI: 10.1021/jm7010996
BindingDB Entry DOI: 10.7270/Q2Q81BCB
Angiopoietin-1 receptor
(Homo sapiens (Human))
BDBM26367
(Aminoquinazoline amide, 35 | N-[3-(2-aminoquinazol...)
Show SMILES Cc1ccc(NC(=O)c2cccc(c2)C(F)(F)F)cc1-c1ccc2nc(N)ncc2c1
Show InChI InChI=1S/C23H17F3N4O/c1-13-5-7-18(29-21(31)15-3-2-4-17(10-15)23(24,25)26)11-19(13)14-6-8-20-16(9-14)12-28-22(27)30-20/h2-12H,1H3,(H,29,31)(H2,27,28,30)
n/an/a 21n/an/an/an/an/an/a
Amgen
Assay Description
The assay involves the phosphorylation of a biotinylated substrate and the detection of this phosphorylation after the addition of a streptavidin-all...
J Med Chem 51: 1681-94 (2008)
Article DOI: 10.1021/jm7010996
BindingDB Entry DOI: 10.7270/Q2Q81BCB
Tyrosine-protein kinase JAK3
(Homo sapiens (Human))
BDBM26367
(Aminoquinazoline amide, 35 | N-[3-(2-aminoquinazol...)
Show SMILES Cc1ccc(NC(=O)c2cccc(c2)C(F)(F)F)cc1-c1ccc2nc(N)ncc2c1
Show InChI InChI=1S/C23H17F3N4O/c1-13-5-7-18(29-21(31)15-3-2-4-17(10-15)23(24,25)26)11-19(13)14-6-8-20-16(9-14)12-28-22(27)30-20/h2-12H,1H3,(H,29,31)(H2,27,28,30)
Reactome pathway
n/an/a 156n/an/an/an/an/an/a
Amgen
Assay Description
The assay involves the phosphorylation of a biotinylated substrate and the detection of this phosphorylation after the addition of a streptavidin-all...
J Med Chem 51: 1681-94 (2008)
Article DOI: 10.1021/jm7010996
BindingDB Entry DOI: 10.7270/Q2Q81BCB
Mitogen-activated protein kinase 14
(Homo sapiens (Human))
BDBM26367
(Aminoquinazoline amide, 35 | N-[3-(2-aminoquinazol...)
Show SMILES Cc1ccc(NC(=O)c2cccc(c2)C(F)(F)F)cc1-c1ccc2nc(N)ncc2c1
Show InChI InChI=1S/C23H17F3N4O/c1-13-5-7-18(29-21(31)15-3-2-4-17(10-15)23(24,25)26)11-19(13)14-6-8-20-16(9-14)12-28-22(27)30-20/h2-12H,1H3,(H,29,31)(H2,27,28,30)
NCI pathway
Reactome pathway
n/an/a 1n/an/an/an/an/an/a
Amgen
Assay Description
In vitro kinase assays were done to establish IC50 values against recombinant enzymes using homogeneous time-resolved fluorescence (HTRF) assay. For ...
J Med Chem 51: 1681-94 (2008)
Article DOI: 10.1021/jm7010996
BindingDB Entry DOI: 10.7270/Q2Q81BCB
Vascular endothelial growth factor receptor 2
(Homo sapiens (Human))
BDBM26367
(Aminoquinazoline amide, 35 | N-[3-(2-aminoquinazol...)
Show SMILES Cc1ccc(NC(=O)c2cccc(c2)C(F)(F)F)cc1-c1ccc2nc(N)ncc2c1
Show InChI InChI=1S/C23H17F3N4O/c1-13-5-7-18(29-21(31)15-3-2-4-17(10-15)23(24,25)26)11-19(13)14-6-8-20-16(9-14)12-28-22(27)30-20/h2-12H,1H3,(H,29,31)(H2,27,28,30)
NCI pathway
Reactome pathway
n/an/a 6n/an/an/an/an/an/a
Amgen
Assay Description
The assay involves the phosphorylation of a biotinylated substrate and the detection of this phosphorylation after the addition of a streptavidin-all...
J Med Chem 51: 1681-94 (2008)
Article DOI: 10.1021/jm7010996
BindingDB Entry DOI: 10.7270/Q2Q81BCB