BDBM26386 Aminopyrimidine amide, 32::N-{4-chloro-3-[(2-{[4-(4-methylpiperazin-1-yl)phenyl]amino}pyrimidin-5-yl)carbamoyl]phenyl}-2,2-difluoro-2H-1,3-benzodioxole-5-carboxamide
SMILES: CN1CCN(CC1)c1ccc(Nc2ncc(NC(=O)c3cc(NC(=O)c4ccc5OC(F)(F)Oc5c4)ccc3Cl)cn2)cc1
InChI Key: InChIKey=WNUWKJKIAMXFRA-UHFFFAOYSA-N
Data: 5 IC50
Activity Spreadsheet -- Enzyme Inhibition Constant Data from BindingDB
Found 5 hits for monomerid = 26386
Trg + Lig
Ki
nM
ΔG°
kcal/mole
IC50
nM
Kd
nM
EC50/IC50
nM
koff
s-1
kon
M-1s-1
pHTemp
°C
Tyrosine-protein kinase Lck
(Homo sapiens (Human))
BDBM26386
(Aminopyrimidine amide, 32 | N-{4-chloro-3-[(2-{[4-...)
Show SMILES CN1CCN(CC1)c1ccc(Nc2ncc(NC(=O)c3cc(NC(=O)c4ccc5OC(F)(F)Oc5c4)ccc3Cl)cn2)cc1
Show InChI InChI=1S/C30H26ClF2N7O4/c1-39-10-12-40(13-11-39)22-6-3-19(4-7-22)38-29-34-16-21(17-35-29)37-28(42)23-15-20(5-8-24(23)31)36-27(41)18-2-9-25-26(14-18)44-30(32,33)43-25/h2-9,14-17H,10-13H2,1H3,(H,36,41)(H,37,42)(H,34,35,38)
n/an/a 1.80n/an/an/an/a7.522
Amgen
Assay Description
The assay involves the phosphorylation of a biotinylated substrate and the detection of this phosphorylation after the addition of a streptavidin-all...
J Med Chem 51: 1681-94 (2008)
Article DOI: 10.1021/jm7010996
BindingDB Entry DOI: 10.7270/Q2Q81BCB
Angiopoietin-1 receptor
(Homo sapiens (Human))
BDBM26386
(Aminopyrimidine amide, 32 | N-{4-chloro-3-[(2-{[4-...)
Show SMILES CN1CCN(CC1)c1ccc(Nc2ncc(NC(=O)c3cc(NC(=O)c4ccc5OC(F)(F)Oc5c4)ccc3Cl)cn2)cc1
Show InChI InChI=1S/C30H26ClF2N7O4/c1-39-10-12-40(13-11-39)22-6-3-19(4-7-22)38-29-34-16-21(17-35-29)37-28(42)23-15-20(5-8-24(23)31)36-27(41)18-2-9-25-26(14-18)44-30(32,33)43-25/h2-9,14-17H,10-13H2,1H3,(H,36,41)(H,37,42)(H,34,35,38)
n/an/a>5.00E+3n/an/an/an/an/an/a
Amgen
Assay Description
The assay involves the phosphorylation of a biotinylated substrate and the detection of this phosphorylation after the addition of a streptavidin-all...
J Med Chem 51: 1681-94 (2008)
Article DOI: 10.1021/jm7010996
BindingDB Entry DOI: 10.7270/Q2Q81BCB
Tyrosine-protein kinase JAK3
(Homo sapiens (Human))
BDBM26386
(Aminopyrimidine amide, 32 | N-{4-chloro-3-[(2-{[4-...)
Show SMILES CN1CCN(CC1)c1ccc(Nc2ncc(NC(=O)c3cc(NC(=O)c4ccc5OC(F)(F)Oc5c4)ccc3Cl)cn2)cc1
Show InChI InChI=1S/C30H26ClF2N7O4/c1-39-10-12-40(13-11-39)22-6-3-19(4-7-22)38-29-34-16-21(17-35-29)37-28(42)23-15-20(5-8-24(23)31)36-27(41)18-2-9-25-26(14-18)44-30(32,33)43-25/h2-9,14-17H,10-13H2,1H3,(H,36,41)(H,37,42)(H,34,35,38)
Reactome pathway
n/an/a>5.00E+3n/an/an/an/an/an/a
Amgen
Assay Description
The assay involves the phosphorylation of a biotinylated substrate and the detection of this phosphorylation after the addition of a streptavidin-all...
J Med Chem 51: 1681-94 (2008)
Article DOI: 10.1021/jm7010996
BindingDB Entry DOI: 10.7270/Q2Q81BCB
Mitogen-activated protein kinase 14
(Homo sapiens (Human))
BDBM26386
(Aminopyrimidine amide, 32 | N-{4-chloro-3-[(2-{[4-...)
Show SMILES CN1CCN(CC1)c1ccc(Nc2ncc(NC(=O)c3cc(NC(=O)c4ccc5OC(F)(F)Oc5c4)ccc3Cl)cn2)cc1
Show InChI InChI=1S/C30H26ClF2N7O4/c1-39-10-12-40(13-11-39)22-6-3-19(4-7-22)38-29-34-16-21(17-35-29)37-28(42)23-15-20(5-8-24(23)31)36-27(41)18-2-9-25-26(14-18)44-30(32,33)43-25/h2-9,14-17H,10-13H2,1H3,(H,36,41)(H,37,42)(H,34,35,38)
NCI pathway
Reactome pathway
n/an/a 6n/an/an/an/an/an/a
Amgen
Assay Description
In vitro kinase assays were done to establish IC50 values against recombinant enzymes using homogeneous time-resolved fluorescence (HTRF) assay. For ...
J Med Chem 51: 1681-94 (2008)
Article DOI: 10.1021/jm7010996
BindingDB Entry DOI: 10.7270/Q2Q81BCB
Vascular endothelial growth factor receptor 2
(Homo sapiens (Human))
BDBM26386
(Aminopyrimidine amide, 32 | N-{4-chloro-3-[(2-{[4-...)
Show SMILES CN1CCN(CC1)c1ccc(Nc2ncc(NC(=O)c3cc(NC(=O)c4ccc5OC(F)(F)Oc5c4)ccc3Cl)cn2)cc1
Show InChI InChI=1S/C30H26ClF2N7O4/c1-39-10-12-40(13-11-39)22-6-3-19(4-7-22)38-29-34-16-21(17-35-29)37-28(42)23-15-20(5-8-24(23)31)36-27(41)18-2-9-25-26(14-18)44-30(32,33)43-25/h2-9,14-17H,10-13H2,1H3,(H,36,41)(H,37,42)(H,34,35,38)
NCI pathway
Reactome pathway
n/an/a 13n/an/an/an/an/an/a
Amgen
Assay Description
The assay involves the phosphorylation of a biotinylated substrate and the detection of this phosphorylation after the addition of a streptavidin-all...
J Med Chem 51: 1681-94 (2008)
Article DOI: 10.1021/jm7010996
BindingDB Entry DOI: 10.7270/Q2Q81BCB