BDBM263949 2-(5-(3-hydroxyphenyl)-1H- pyrazol-1-yl)isonicotinic acid::US10173996, Example 17::US9604961, Example 17::US9714230, 17::US9908865, Example 17
SMILES: OC(=O)c1ccnc(c1)-n1nccc1-c1cccc(O)c1
InChI Key: InChIKey=QVSDPEWGBYKEDU-UHFFFAOYSA-N
Data: 18 IC50
PDB links: 1 PDB ID matches this monomer.
Activity Spreadsheet -- Enzyme Inhibition Constant Data from BindingDB
Found 18 hits for monomerid = 263949
Trg + Lig
Ki
nM
ΔG°
kcal/mole
IC50
nM
Kd
nM
EC50/IC50
nM
koff
s-1
kon
M-1s-1
pHTemp
°C
Lysine-specific demethylase 5A
(Homo sapiens (Human))
BDBM263949
(2-(5-(3-hydroxyphenyl)-1H- pyrazol-1-yl)isonicotin...)
Show SMILES OC(=O)c1ccnc(c1)-n1nccc1-c1cccc(O)c1
Show InChI InChI=1S/C15H11N3O3/c19-12-3-1-2-10(8-12)13-5-7-17-18(13)14-9-11(15(20)21)4-6-16-14/h1-9,19H,(H,20,21)
Reactome pathway
US Patent
n/an/a 550n/an/an/an/an/a25
Celgene Quantical Research, Inc.
US Patent
Assay Description
The enzymatic assay of Jarid1A activity is based upon Time Resolved-Fluorescence Resonance Energy Transfer (TR-FRET) detection. The ability of test c...
US Patent US9714230 (2017)
BindingDB Entry DOI: 10.7270/Q2CR5WC6
Lysine-specific demethylase 4C
(Homo sapiens (Human))
BDBM263949
(2-(5-(3-hydroxyphenyl)-1H- pyrazol-1-yl)isonicotin...)
Show SMILES OC(=O)c1ccnc(c1)-n1nccc1-c1cccc(O)c1
Show InChI InChI=1S/C15H11N3O3/c19-12-3-1-2-10(8-12)13-5-7-17-18(13)14-9-11(15(20)21)4-6-16-14/h1-9,19H,(H,20,21)
n/an/a 410n/an/an/an/an/an/a
Celgene Corporation
Curated by ChEMBL
Assay Description
Inhibition of KDM4C (unknown origin) preincubated with enzyme
Bioorg Med Chem Lett 28: 1490-1494 (2018)
Article DOI: 10.1016/j.bmcl.2018.03.083
BindingDB Entry DOI: 10.7270/Q26Q20W4
Lysine-specific demethylase 4C
(Homo sapiens (Human))
BDBM263949
(2-(5-(3-hydroxyphenyl)-1H- pyrazol-1-yl)isonicotin...)
Show SMILES OC(=O)c1ccnc(c1)-n1nccc1-c1cccc(O)c1
Show InChI InChI=1S/C15H11N3O3/c19-12-3-1-2-10(8-12)13-5-7-17-18(13)14-9-11(15(20)21)4-6-16-14/h1-9,19H,(H,20,21)
US Patent
n/an/a 550n/an/an/an/an/a25
Celgene Quantical Research, Inc.
US Patent
Assay Description
The ability of test compounds to inhibit the activity of JMJD2C was determined in 384-well plate format under the following reaction conditions: 0.3 ...
US Patent US9714230 (2017)
BindingDB Entry DOI: 10.7270/Q2CR5WC6
Lysine-specific demethylase 4A
(Homo sapiens (Human))
BDBM263949
(2-(5-(3-hydroxyphenyl)-1H- pyrazol-1-yl)isonicotin...)
Show SMILES OC(=O)c1ccnc(c1)-n1nccc1-c1cccc(O)c1
Show InChI InChI=1S/C15H11N3O3/c19-12-3-1-2-10(8-12)13-5-7-17-18(13)14-9-11(15(20)21)4-6-16-14/h1-9,19H,(H,20,21)
US Patent
n/an/a 550n/an/an/an/an/a25
Celgene Quantical Research, Inc.
US Patent
Assay Description
The ability of test compounds to inhibit the activity of JMJD2A was determined in 384-well plate format under the following reaction conditions: 2 nM...
US Patent US9714230 (2017)
BindingDB Entry DOI: 10.7270/Q2CR5WC6
3D
3D Structure (crystal)
Lysine-specific demethylase 5A
(Homo sapiens (Human))
BDBM263949
(2-(5-(3-hydroxyphenyl)-1H- pyrazol-1-yl)isonicotin...)
Show SMILES OC(=O)c1ccnc(c1)-n1nccc1-c1cccc(O)c1
Show InChI InChI=1S/C15H11N3O3/c19-12-3-1-2-10(8-12)13-5-7-17-18(13)14-9-11(15(20)21)4-6-16-14/h1-9,19H,(H,20,21)
Reactome pathway
US Patent
n/an/a 55n/an/an/an/an/an/a
Celgene Quanticel Research, Inc.
US Patent
Assay Description
The enzymatic assay of Jarid1A activity is based upon Time Resolved-Fluorescence Resonance Energy Transfer (TR-FRET) detection. The ability of test c...
US Patent US9604961 (2017)
BindingDB Entry DOI: 10.7270/Q2KP847M
Lysine-specific demethylase 5B
(Homo sapiens (Human))
BDBM263949
(2-(5-(3-hydroxyphenyl)-1H- pyrazol-1-yl)isonicotin...)
Show SMILES OC(=O)c1ccnc(c1)-n1nccc1-c1cccc(O)c1
Show InChI InChI=1S/C15H11N3O3/c19-12-3-1-2-10(8-12)13-5-7-17-18(13)14-9-11(15(20)21)4-6-16-14/h1-9,19H,(H,20,21)
US Patent
n/an/a 55n/an/an/an/an/an/a
Celgene Quanticel Research, Inc.
US Patent
Assay Description
The ability of test compounds to inhibit the activity of Jarid1B was determined in 384-well plate format under the following reaction conditions: 0.8...
US Patent US9604961 (2017)
BindingDB Entry DOI: 10.7270/Q2KP847M
Lysine-specific demethylase 4C
(Homo sapiens (Human))
BDBM263949
(2-(5-(3-hydroxyphenyl)-1H- pyrazol-1-yl)isonicotin...)
Show SMILES OC(=O)c1ccnc(c1)-n1nccc1-c1cccc(O)c1
Show InChI InChI=1S/C15H11N3O3/c19-12-3-1-2-10(8-12)13-5-7-17-18(13)14-9-11(15(20)21)4-6-16-14/h1-9,19H,(H,20,21)
US Patent
n/an/a 55n/an/an/an/an/an/a
Celgene Quanticel Research, Inc.
US Patent
Assay Description
The ability of test compounds to inhibit the activity of JMJD2C was determined in 384-well plate format under the following reaction conditions: 0.3 ...
US Patent US9604961 (2017)
BindingDB Entry DOI: 10.7270/Q2KP847M
jmjd2a
(Homo sapiens (Human))
BDBM263949
(2-(5-(3-hydroxyphenyl)-1H- pyrazol-1-yl)isonicotin...)
Show SMILES OC(=O)c1ccnc(c1)-n1nccc1-c1cccc(O)c1
Show InChI InChI=1S/C15H11N3O3/c19-12-3-1-2-10(8-12)13-5-7-17-18(13)14-9-11(15(20)21)4-6-16-14/h1-9,19H,(H,20,21)
US Patent
n/an/a 55n/an/an/an/an/an/a
Celgene Quanticel Research, Inc.
US Patent
Assay Description
The ability of test compounds to inhibit the activity of JMJD2A was determined in 384-well plate format under the following reaction conditions: 2 nM...
US Patent US9604961 (2017)
BindingDB Entry DOI: 10.7270/Q2KP847M
3D
3D Structure (crystal)
Lysine-specific demethylase 5A
(Homo sapiens (Human))
BDBM263949
(2-(5-(3-hydroxyphenyl)-1H- pyrazol-1-yl)isonicotin...)
Show SMILES OC(=O)c1ccnc(c1)-n1nccc1-c1cccc(O)c1
Show InChI InChI=1S/C15H11N3O3/c19-12-3-1-2-10(8-12)13-5-7-17-18(13)14-9-11(15(20)21)4-6-16-14/h1-9,19H,(H,20,21)
Reactome pathway
US Patent
n/an/a 550n/an/an/an/an/an/a
Celgene Quanticel Research, Inc.
US Patent
Assay Description
The enzymatic assay of Jarid1A activity is based upon Time Resolved-Fluorescence Resonance Energy Transfer (TR-FRET) detection. The ability of test c...
US Patent US10173996 (2019)
BindingDB Entry DOI: 10.7270/Q2CJ8GK0
Lysine-specific demethylase 5B
(Homo sapiens (Human))
BDBM263949
(2-(5-(3-hydroxyphenyl)-1H- pyrazol-1-yl)isonicotin...)
Show SMILES OC(=O)c1ccnc(c1)-n1nccc1-c1cccc(O)c1
Show InChI InChI=1S/C15H11N3O3/c19-12-3-1-2-10(8-12)13-5-7-17-18(13)14-9-11(15(20)21)4-6-16-14/h1-9,19H,(H,20,21)
US Patent
n/an/a 550n/an/an/an/an/an/a
Celgene Quanticel Research, Inc.
US Patent
Assay Description
The ability of test compounds to inhibit the activity of Jarid1B was determined in 384-well plate format under the following reaction conditions: 0.8...
US Patent US10173996 (2019)
BindingDB Entry DOI: 10.7270/Q2CJ8GK0
Lysine-specific demethylase 4C
(Homo sapiens (Human))
BDBM263949
(2-(5-(3-hydroxyphenyl)-1H- pyrazol-1-yl)isonicotin...)
Show SMILES OC(=O)c1ccnc(c1)-n1nccc1-c1cccc(O)c1
Show InChI InChI=1S/C15H11N3O3/c19-12-3-1-2-10(8-12)13-5-7-17-18(13)14-9-11(15(20)21)4-6-16-14/h1-9,19H,(H,20,21)
US Patent
n/an/a 550n/an/an/an/an/an/a
Celgene Quanticel Research, Inc.
US Patent
Assay Description
The ability of test compounds to inhibit the activity of JMJD2C was determined in 384-well plate format under the following reaction conditions: 0.3 ...
US Patent US10173996 (2019)
BindingDB Entry DOI: 10.7270/Q2CJ8GK0
Lysine-specific demethylase 4A
(Homo sapiens (Human))
BDBM263949
(2-(5-(3-hydroxyphenyl)-1H- pyrazol-1-yl)isonicotin...)
Show SMILES OC(=O)c1ccnc(c1)-n1nccc1-c1cccc(O)c1
Show InChI InChI=1S/C15H11N3O3/c19-12-3-1-2-10(8-12)13-5-7-17-18(13)14-9-11(15(20)21)4-6-16-14/h1-9,19H,(H,20,21)
US Patent
n/an/a 550n/an/an/an/an/an/a
Celgene Quanticel Research, Inc.
US Patent
Assay Description
The ability of test compounds to inhibit the activity of JMJD2A was determined in 384-well plate format under the following reaction conditions: 2 nM...
US Patent US10173996 (2019)
BindingDB Entry DOI: 10.7270/Q2CJ8GK0
3D
3D Structure (crystal)
Lysine-specific demethylase 5A
(Homo sapiens (Human))
BDBM263949
(2-(5-(3-hydroxyphenyl)-1H- pyrazol-1-yl)isonicotin...)
Show SMILES OC(=O)c1ccnc(c1)-n1nccc1-c1cccc(O)c1
Show InChI InChI=1S/C15H11N3O3/c19-12-3-1-2-10(8-12)13-5-7-17-18(13)14-9-11(15(20)21)4-6-16-14/h1-9,19H,(H,20,21)
Reactome pathway
US Patent
n/an/a 550n/an/an/an/an/an/a
The Scripps Research Institute
Assay Description
The enzymatic assay of Jarid1A activity is based upon Time Resolved-Fluorescence Resonance Energy Transfer (TR-FRET) detection. The ability of test c...
J Med Chem 50: 3359-68 (2007)
BindingDB Entry DOI: 10.7270/Q29Z9762
Lysine-specific demethylase 5B
(Homo sapiens (Human))
BDBM263949
(2-(5-(3-hydroxyphenyl)-1H- pyrazol-1-yl)isonicotin...)
Show SMILES OC(=O)c1ccnc(c1)-n1nccc1-c1cccc(O)c1
Show InChI InChI=1S/C15H11N3O3/c19-12-3-1-2-10(8-12)13-5-7-17-18(13)14-9-11(15(20)21)4-6-16-14/h1-9,19H,(H,20,21)
US Patent
n/an/a 550n/an/an/an/an/an/a
The Scripps Research Institute
Assay Description
The ability of test compounds to inhibit the activity of Jarid1B was determined in 384-well plate format under the following reaction conditions: 0.8...
J Med Chem 50: 3359-68 (2007)
BindingDB Entry DOI: 10.7270/Q29Z9762
Lysine-specific demethylase 4C
(Homo sapiens (Human))
BDBM263949
(2-(5-(3-hydroxyphenyl)-1H- pyrazol-1-yl)isonicotin...)
Show SMILES OC(=O)c1ccnc(c1)-n1nccc1-c1cccc(O)c1
Show InChI InChI=1S/C15H11N3O3/c19-12-3-1-2-10(8-12)13-5-7-17-18(13)14-9-11(15(20)21)4-6-16-14/h1-9,19H,(H,20,21)
US Patent
n/an/a 550n/an/an/an/an/an/a
The Scripps Research Institute
Assay Description
The ability of test compounds to inhibit the activity of JMJD2C was determined in 384-well plate format under the following reaction conditions: 0.3 ...
J Med Chem 50: 3359-68 (2007)
BindingDB Entry DOI: 10.7270/Q29Z9762
Lysine-specific demethylase 4A
(Homo sapiens (Human))
BDBM263949
(2-(5-(3-hydroxyphenyl)-1H- pyrazol-1-yl)isonicotin...)
Show SMILES OC(=O)c1ccnc(c1)-n1nccc1-c1cccc(O)c1
Show InChI InChI=1S/C15H11N3O3/c19-12-3-1-2-10(8-12)13-5-7-17-18(13)14-9-11(15(20)21)4-6-16-14/h1-9,19H,(H,20,21)
US Patent
n/an/a 550n/an/an/an/an/an/a
The Scripps Research Institute
Assay Description
The ability of test compounds to inhibit the activity of JMJD2A was determined in 38-well plate format under the following reaction conditions: 2 nM ...
J Med Chem 50: 3359-68 (2007)
BindingDB Entry DOI: 10.7270/Q29Z9762
3D
3D Structure (crystal)
Lysine-specific demethylase 5B
(Homo sapiens (Human))
BDBM263949
(2-(5-(3-hydroxyphenyl)-1H- pyrazol-1-yl)isonicotin...)
Show SMILES OC(=O)c1ccnc(c1)-n1nccc1-c1cccc(O)c1
Show InChI InChI=1S/C15H11N3O3/c19-12-3-1-2-10(8-12)13-5-7-17-18(13)14-9-11(15(20)21)4-6-16-14/h1-9,19H,(H,20,21)
n/an/a 120n/an/an/an/an/an/a
Celgene Corporation
Curated by ChEMBL
Assay Description
Inhibition of KDM5B (unknown origin) preincubated with enzyme
Bioorg Med Chem Lett 28: 1490-1494 (2018)
Article DOI: 10.1016/j.bmcl.2018.03.083
BindingDB Entry DOI: 10.7270/Q26Q20W4
Lysine-specific demethylase 5B
(Homo sapiens (Human))
BDBM263949
(2-(5-(3-hydroxyphenyl)-1H- pyrazol-1-yl)isonicotin...)
Show SMILES OC(=O)c1ccnc(c1)-n1nccc1-c1cccc(O)c1
Show InChI InChI=1S/C15H11N3O3/c19-12-3-1-2-10(8-12)13-5-7-17-18(13)14-9-11(15(20)21)4-6-16-14/h1-9,19H,(H,20,21)
US Patent
n/an/a 550n/an/an/an/an/a25
Celgene Quantical Research, Inc.
US Patent
Assay Description
The ability of test compounds to inhibit the activity of Jarid1B was determined in 384-well plate format under the following reaction conditions: 0.8...
US Patent US9714230 (2017)
BindingDB Entry DOI: 10.7270/Q2CR5WC6