BDBM264048 2-[5-[(2-methoxy-4- methylphenyl)methoxy]pyrazol-1- yl]pyridine-4-carboxylic acid::US10173996, Example 133::US9604961, Example 133::US9714230, 133::US9908865, Example 133
SMILES: COc1cc(C)ccc1COc1ccnn1-c1cc(ccn1)C(O)=O
InChI Key: InChIKey=WAPIESSEOAYVNJ-UHFFFAOYSA-N
Data: 20 IC50
Activity Spreadsheet -- Enzyme Inhibition Constant Data from BindingDB
Found 20 hits for monomerid = 264048
Trg + Lig
Ki
nM
ΔG°
kcal/mole
IC50
nM
Kd
nM
EC50/IC50
nM
koff
s-1
kon
M-1s-1
pHTemp
°C
Lysine-specific demethylase 5A
(Homo sapiens (Human))
BDBM264048
(2-[5-[(2-methoxy-4- methylphenyl)methoxy]pyrazol-1...)
Show SMILES COc1cc(C)ccc1COc1ccnn1-c1cc(ccn1)C(O)=O
Show InChI InChI=1S/C18H17N3O4/c1-12-3-4-14(15(9-12)24-2)11-25-17-6-8-20-21(17)16-10-13(18(22)23)5-7-19-16/h3-10H,11H2,1-2H3,(H,22,23)
Reactome pathway
US Patent
n/an/a<100n/an/an/an/an/a25
Celgene Quantical Research, Inc.
US Patent
Assay Description
The enzymatic assay of Jarid1A activity is based upon Time Resolved-Fluorescence Resonance Energy Transfer (TR-FRET) detection. The ability of test c...
US Patent US9714230 (2017)
BindingDB Entry DOI: 10.7270/Q2CR5WC6
Lysine-specific demethylase 2B
(Homo sapiens (Human))
BDBM264048
(2-[5-[(2-methoxy-4- methylphenyl)methoxy]pyrazol-1...)
Show SMILES COc1cc(C)ccc1COc1ccnn1-c1cc(ccn1)C(O)=O
Show InChI InChI=1S/C18H17N3O4/c1-12-3-4-14(15(9-12)24-2)11-25-17-6-8-20-21(17)16-10-13(18(22)23)5-7-19-16/h3-10H,11H2,1-2H3,(H,22,23)
US Patent
n/an/a 5.50E+3n/an/an/an/an/an/a
The Scripps Research Institute
Assay Description
The ability of test compounds to inhibit the activity of FBXL10 was determined in 384-well plate format under the following reaction conditions: 0.3 ...
J Med Chem 50: 3359-68 (2007)
BindingDB Entry DOI: 10.7270/Q29Z9762
Lysine-specific demethylase 4C
(Homo sapiens (Human))
BDBM264048
(2-[5-[(2-methoxy-4- methylphenyl)methoxy]pyrazol-1...)
Show SMILES COc1cc(C)ccc1COc1ccnn1-c1cc(ccn1)C(O)=O
Show InChI InChI=1S/C18H17N3O4/c1-12-3-4-14(15(9-12)24-2)11-25-17-6-8-20-21(17)16-10-13(18(22)23)5-7-19-16/h3-10H,11H2,1-2H3,(H,22,23)
US Patent
n/an/a 550n/an/an/an/an/a25
Celgene Quantical Research, Inc.
US Patent
Assay Description
The ability of test compounds to inhibit the activity of JMJD2C was determined in 384-well plate format under the following reaction conditions: 0.3 ...
US Patent US9714230 (2017)
BindingDB Entry DOI: 10.7270/Q2CR5WC6
Lysine-specific demethylase 4A
(Homo sapiens (Human))
BDBM264048
(2-[5-[(2-methoxy-4- methylphenyl)methoxy]pyrazol-1...)
Show SMILES COc1cc(C)ccc1COc1ccnn1-c1cc(ccn1)C(O)=O
Show InChI InChI=1S/C18H17N3O4/c1-12-3-4-14(15(9-12)24-2)11-25-17-6-8-20-21(17)16-10-13(18(22)23)5-7-19-16/h3-10H,11H2,1-2H3,(H,22,23)
US Patent
n/an/a 550n/an/an/an/an/a25
Celgene Quantical Research, Inc.
US Patent
Assay Description
The ability of test compounds to inhibit the activity of JMJD2A was determined in 384-well plate format under the following reaction conditions: 2 nM...
US Patent US9714230 (2017)
BindingDB Entry DOI: 10.7270/Q2CR5WC6
Lysine-specific demethylase 2B
(Homo sapiens (Human))
BDBM264048
(2-[5-[(2-methoxy-4- methylphenyl)methoxy]pyrazol-1...)
Show SMILES COc1cc(C)ccc1COc1ccnn1-c1cc(ccn1)C(O)=O
Show InChI InChI=1S/C18H17N3O4/c1-12-3-4-14(15(9-12)24-2)11-25-17-6-8-20-21(17)16-10-13(18(22)23)5-7-19-16/h3-10H,11H2,1-2H3,(H,22,23)
US Patent
n/an/a 5.50E+3n/an/an/an/an/a25
Celgene Quantical Research, Inc.
US Patent
Assay Description
The ability of test compounds to inhibit the activity of FBXL10 was determined in 384-well plate format under the following reaction conditions: 0.3 ...
US Patent US9714230 (2017)
BindingDB Entry DOI: 10.7270/Q2CR5WC6
Lysine-specific demethylase 5A
(Homo sapiens (Human))
BDBM264048
(2-[5-[(2-methoxy-4- methylphenyl)methoxy]pyrazol-1...)
Show SMILES COc1cc(C)ccc1COc1ccnn1-c1cc(ccn1)C(O)=O
Show InChI InChI=1S/C18H17N3O4/c1-12-3-4-14(15(9-12)24-2)11-25-17-6-8-20-21(17)16-10-13(18(22)23)5-7-19-16/h3-10H,11H2,1-2H3,(H,22,23)
Reactome pathway
US Patent
n/an/a<10n/an/an/an/an/an/a
Celgene Quanticel Research, Inc.
US Patent
Assay Description
The enzymatic assay of Jarid1A activity is based upon Time Resolved-Fluorescence Resonance Energy Transfer (TR-FRET) detection. The ability of test c...
US Patent US9604961 (2017)
BindingDB Entry DOI: 10.7270/Q2KP847M
Lysine-specific demethylase 5B
(Homo sapiens (Human))
BDBM264048
(2-[5-[(2-methoxy-4- methylphenyl)methoxy]pyrazol-1...)
Show SMILES COc1cc(C)ccc1COc1ccnn1-c1cc(ccn1)C(O)=O
Show InChI InChI=1S/C18H17N3O4/c1-12-3-4-14(15(9-12)24-2)11-25-17-6-8-20-21(17)16-10-13(18(22)23)5-7-19-16/h3-10H,11H2,1-2H3,(H,22,23)
US Patent
n/an/a<10n/an/an/an/an/an/a
Celgene Quanticel Research, Inc.
US Patent
Assay Description
The ability of test compounds to inhibit the activity of Jarid1B was determined in 384-well plate format under the following reaction conditions: 0.8...
US Patent US9604961 (2017)
BindingDB Entry DOI: 10.7270/Q2KP847M
Lysine-specific demethylase 4C
(Homo sapiens (Human))
BDBM264048
(2-[5-[(2-methoxy-4- methylphenyl)methoxy]pyrazol-1...)
Show SMILES COc1cc(C)ccc1COc1ccnn1-c1cc(ccn1)C(O)=O
Show InChI InChI=1S/C18H17N3O4/c1-12-3-4-14(15(9-12)24-2)11-25-17-6-8-20-21(17)16-10-13(18(22)23)5-7-19-16/h3-10H,11H2,1-2H3,(H,22,23)
US Patent
n/an/a 55n/an/an/an/an/an/a
Celgene Quanticel Research, Inc.
US Patent
Assay Description
The ability of test compounds to inhibit the activity of JMJD2C was determined in 384-well plate format under the following reaction conditions: 0.3 ...
US Patent US9604961 (2017)
BindingDB Entry DOI: 10.7270/Q2KP847M
jmjd2a
(Homo sapiens (Human))
BDBM264048
(2-[5-[(2-methoxy-4- methylphenyl)methoxy]pyrazol-1...)
Show SMILES COc1cc(C)ccc1COc1ccnn1-c1cc(ccn1)C(O)=O
Show InChI InChI=1S/C18H17N3O4/c1-12-3-4-14(15(9-12)24-2)11-25-17-6-8-20-21(17)16-10-13(18(22)23)5-7-19-16/h3-10H,11H2,1-2H3,(H,22,23)
US Patent
n/an/a 55n/an/an/an/an/an/a
Celgene Quanticel Research, Inc.
US Patent
Assay Description
The ability of test compounds to inhibit the activity of JMJD2A was determined in 384-well plate format under the following reaction conditions: 2 nM...
US Patent US9604961 (2017)
BindingDB Entry DOI: 10.7270/Q2KP847M
Lysine-specific demethylase 2B
(Homo sapiens (Human))
BDBM264048
(2-[5-[(2-methoxy-4- methylphenyl)methoxy]pyrazol-1...)
Show SMILES COc1cc(C)ccc1COc1ccnn1-c1cc(ccn1)C(O)=O
Show InChI InChI=1S/C18H17N3O4/c1-12-3-4-14(15(9-12)24-2)11-25-17-6-8-20-21(17)16-10-13(18(22)23)5-7-19-16/h3-10H,11H2,1-2H3,(H,22,23)
US Patent
n/an/a 5.50E+3n/an/an/an/an/an/a
Celgene Quanticel Research, Inc.
US Patent
Assay Description
The ability of test compounds to inhibit the activity of FBXL10 was determined in 384-well plate format under the following reaction conditions: 0.3 ...
US Patent US9604961 (2017)
BindingDB Entry DOI: 10.7270/Q2KP847M
Lysine-specific demethylase 5A
(Homo sapiens (Human))
BDBM264048
(2-[5-[(2-methoxy-4- methylphenyl)methoxy]pyrazol-1...)
Show SMILES COc1cc(C)ccc1COc1ccnn1-c1cc(ccn1)C(O)=O
Show InChI InChI=1S/C18H17N3O4/c1-12-3-4-14(15(9-12)24-2)11-25-17-6-8-20-21(17)16-10-13(18(22)23)5-7-19-16/h3-10H,11H2,1-2H3,(H,22,23)
Reactome pathway
US Patent
n/an/a<100n/an/an/an/an/an/a
Celgene Quanticel Research, Inc.
US Patent
Assay Description
The enzymatic assay of Jarid1A activity is based upon Time Resolved-Fluorescence Resonance Energy Transfer (TR-FRET) detection. The ability of test c...
US Patent US10173996 (2019)
BindingDB Entry DOI: 10.7270/Q2CJ8GK0
Lysine-specific demethylase 5B
(Homo sapiens (Human))
BDBM264048
(2-[5-[(2-methoxy-4- methylphenyl)methoxy]pyrazol-1...)
Show SMILES COc1cc(C)ccc1COc1ccnn1-c1cc(ccn1)C(O)=O
Show InChI InChI=1S/C18H17N3O4/c1-12-3-4-14(15(9-12)24-2)11-25-17-6-8-20-21(17)16-10-13(18(22)23)5-7-19-16/h3-10H,11H2,1-2H3,(H,22,23)
US Patent
n/an/a<100n/an/an/an/an/an/a
Celgene Quanticel Research, Inc.
US Patent
Assay Description
The ability of test compounds to inhibit the activity of Jarid1B was determined in 384-well plate format under the following reaction conditions: 0.8...
US Patent US10173996 (2019)
BindingDB Entry DOI: 10.7270/Q2CJ8GK0
Lysine-specific demethylase 4C
(Homo sapiens (Human))
BDBM264048
(2-[5-[(2-methoxy-4- methylphenyl)methoxy]pyrazol-1...)
Show SMILES COc1cc(C)ccc1COc1ccnn1-c1cc(ccn1)C(O)=O
Show InChI InChI=1S/C18H17N3O4/c1-12-3-4-14(15(9-12)24-2)11-25-17-6-8-20-21(17)16-10-13(18(22)23)5-7-19-16/h3-10H,11H2,1-2H3,(H,22,23)
US Patent
n/an/a 550n/an/an/an/an/an/a
Celgene Quanticel Research, Inc.
US Patent
Assay Description
The ability of test compounds to inhibit the activity of JMJD2C was determined in 384-well plate format under the following reaction conditions: 0.3 ...
US Patent US10173996 (2019)
BindingDB Entry DOI: 10.7270/Q2CJ8GK0
Lysine-specific demethylase 4A
(Homo sapiens (Human))
BDBM264048
(2-[5-[(2-methoxy-4- methylphenyl)methoxy]pyrazol-1...)
Show SMILES COc1cc(C)ccc1COc1ccnn1-c1cc(ccn1)C(O)=O
Show InChI InChI=1S/C18H17N3O4/c1-12-3-4-14(15(9-12)24-2)11-25-17-6-8-20-21(17)16-10-13(18(22)23)5-7-19-16/h3-10H,11H2,1-2H3,(H,22,23)
US Patent
n/an/a 550n/an/an/an/an/an/a
Celgene Quanticel Research, Inc.
US Patent
Assay Description
The ability of test compounds to inhibit the activity of JMJD2A was determined in 384-well plate format under the following reaction conditions: 2 nM...
US Patent US10173996 (2019)
BindingDB Entry DOI: 10.7270/Q2CJ8GK0
Lysine-specific demethylase 2B
(Homo sapiens (Human))
BDBM264048
(2-[5-[(2-methoxy-4- methylphenyl)methoxy]pyrazol-1...)
Show SMILES COc1cc(C)ccc1COc1ccnn1-c1cc(ccn1)C(O)=O
Show InChI InChI=1S/C18H17N3O4/c1-12-3-4-14(15(9-12)24-2)11-25-17-6-8-20-21(17)16-10-13(18(22)23)5-7-19-16/h3-10H,11H2,1-2H3,(H,22,23)
US Patent
n/an/a 5.50E+3n/an/an/an/an/an/a
Celgene Quanticel Research, Inc.
US Patent
Assay Description
The ability of test compounds to inhibit the activity of FBXL10 was determined in 384-well plate format under the following reaction conditions: 0.3 ...
US Patent US10173996 (2019)
BindingDB Entry DOI: 10.7270/Q2CJ8GK0
Lysine-specific demethylase 5A
(Homo sapiens (Human))
BDBM264048
(2-[5-[(2-methoxy-4- methylphenyl)methoxy]pyrazol-1...)
Show SMILES COc1cc(C)ccc1COc1ccnn1-c1cc(ccn1)C(O)=O
Show InChI InChI=1S/C18H17N3O4/c1-12-3-4-14(15(9-12)24-2)11-25-17-6-8-20-21(17)16-10-13(18(22)23)5-7-19-16/h3-10H,11H2,1-2H3,(H,22,23)
Reactome pathway
US Patent
n/an/a<100n/an/an/an/an/an/a
The Scripps Research Institute
Assay Description
The enzymatic assay of Jarid1A activity is based upon Time Resolved-Fluorescence Resonance Energy Transfer (TR-FRET) detection. The ability of test c...
J Med Chem 50: 3359-68 (2007)
BindingDB Entry DOI: 10.7270/Q29Z9762
Lysine-specific demethylase 5B
(Homo sapiens (Human))
BDBM264048
(2-[5-[(2-methoxy-4- methylphenyl)methoxy]pyrazol-1...)
Show SMILES COc1cc(C)ccc1COc1ccnn1-c1cc(ccn1)C(O)=O
Show InChI InChI=1S/C18H17N3O4/c1-12-3-4-14(15(9-12)24-2)11-25-17-6-8-20-21(17)16-10-13(18(22)23)5-7-19-16/h3-10H,11H2,1-2H3,(H,22,23)
US Patent
n/an/a<100n/an/an/an/an/an/a
The Scripps Research Institute
Assay Description
The ability of test compounds to inhibit the activity of Jarid1B was determined in 384-well plate format under the following reaction conditions: 0.8...
J Med Chem 50: 3359-68 (2007)
BindingDB Entry DOI: 10.7270/Q29Z9762
Lysine-specific demethylase 4C
(Homo sapiens (Human))
BDBM264048
(2-[5-[(2-methoxy-4- methylphenyl)methoxy]pyrazol-1...)
Show SMILES COc1cc(C)ccc1COc1ccnn1-c1cc(ccn1)C(O)=O
Show InChI InChI=1S/C18H17N3O4/c1-12-3-4-14(15(9-12)24-2)11-25-17-6-8-20-21(17)16-10-13(18(22)23)5-7-19-16/h3-10H,11H2,1-2H3,(H,22,23)
US Patent
n/an/a 550n/an/an/an/an/an/a
The Scripps Research Institute
Assay Description
The ability of test compounds to inhibit the activity of JMJD2C was determined in 384-well plate format under the following reaction conditions: 0.3 ...
J Med Chem 50: 3359-68 (2007)
BindingDB Entry DOI: 10.7270/Q29Z9762
Lysine-specific demethylase 4A
(Homo sapiens (Human))
BDBM264048
(2-[5-[(2-methoxy-4- methylphenyl)methoxy]pyrazol-1...)
Show SMILES COc1cc(C)ccc1COc1ccnn1-c1cc(ccn1)C(O)=O
Show InChI InChI=1S/C18H17N3O4/c1-12-3-4-14(15(9-12)24-2)11-25-17-6-8-20-21(17)16-10-13(18(22)23)5-7-19-16/h3-10H,11H2,1-2H3,(H,22,23)
US Patent
n/an/a 550n/an/an/an/an/an/a
The Scripps Research Institute
Assay Description
The ability of test compounds to inhibit the activity of JMJD2A was determined in 38-well plate format under the following reaction conditions: 2 nM ...
J Med Chem 50: 3359-68 (2007)
BindingDB Entry DOI: 10.7270/Q29Z9762
Lysine-specific demethylase 5B
(Homo sapiens (Human))
BDBM264048
(2-[5-[(2-methoxy-4- methylphenyl)methoxy]pyrazol-1...)
Show SMILES COc1cc(C)ccc1COc1ccnn1-c1cc(ccn1)C(O)=O
Show InChI InChI=1S/C18H17N3O4/c1-12-3-4-14(15(9-12)24-2)11-25-17-6-8-20-21(17)16-10-13(18(22)23)5-7-19-16/h3-10H,11H2,1-2H3,(H,22,23)
US Patent
n/an/a<100n/an/an/an/an/a25
Celgene Quantical Research, Inc.
US Patent
Assay Description
The ability of test compounds to inhibit the activity of Jarid1B was determined in 384-well plate format under the following reaction conditions: 0.8...
US Patent US9714230 (2017)
BindingDB Entry DOI: 10.7270/Q2CR5WC6