null
SMILES: COc1ccn(-c2ccc(cc2)N2CCN(CCCc3c[nH]c4ccc(cc34)C#N)CC2)c(=O)c1
InChI Key: InChIKey=UXYBQHAMKCVWPG-UHFFFAOYSA-N
Activity Spreadsheet -- Enzyme Inhibition Constant Data from BindingDB
Found 3 hits for monomerid = 264109
Trg + Lig
Ki
nM
ΔG°
kcal/mole
IC50
nM
Kd
nM
EC50/IC50
nM
koff
s-1
kon
M-1s-1
pHTemp
°C
5-hydroxytryptamine receptor 1A
(Homo sapiens (Human))
BDBM264109
(3-(3-(4-(4-(4-methoxy-2-oxopyridin-1(2H)-yl)phenyl...)
Show SMILES COc1ccn(-c2ccc(cc2)N2CCN(CCCc3c[nH]c4ccc(cc34)C#N)CC2)c(=O)c1
Show InChI InChI=1S/C28H29N5O2/c1-35-25-10-12-33(28(34)18-25)24-7-5-23(6-8-24)32-15-13-31(14-16-32)11-2-3-22-20-30-27-9-4-21(19-29)17-26(22)27/h4-10,12,17-18,20,30H,2-3,11,13-16H2,1H3
US Patent
0.610n/an/an/an/an/an/a7.4n/a
SUNSHINE LAKE PHARMA CO., LTD.
US Patent
Assay Description
Human HEK-293 cell homogenates (36 μg protein) were incubated at 22° C. for 60 minutes with 0.3 nM [3H]8-0H-DPAT (Perkin-Elmer) in the absence o...
US Patent US9714232 (2017)
BindingDB Entry DOI: 10.7270/Q28054N5
Sodium-dependent serotonin transporter
(Rattus norvegicus (rat))
BDBM264109
(3-(3-(4-(4-(4-methoxy-2-oxopyridin-1(2H)-yl)phenyl...)
Show SMILES COc1ccn(-c2ccc(cc2)N2CCN(CCCc3c[nH]c4ccc(cc34)C#N)CC2)c(=O)c1
Show InChI InChI=1S/C28H29N5O2/c1-35-25-10-12-33(28(34)18-25)24-7-5-23(6-8-24)32-15-13-31(14-16-32)11-2-3-22-20-30-27-9-4-21(19-29)17-26(22)27/h4-10,12,17-18,20,30H,2-3,11,13-16H2,1H3
n/an/a 4.60n/an/an/an/an/an/a
TBA
Citation and Details
5-hydroxytryptamine receptor 1A
(Rattus norvegicus (rat))
BDBM264109
(3-(3-(4-(4-(4-methoxy-2-oxopyridin-1(2H)-yl)phenyl...)
Show SMILES COc1ccn(-c2ccc(cc2)N2CCN(CCCc3c[nH]c4ccc(cc34)C#N)CC2)c(=O)c1
Show InChI InChI=1S/C28H29N5O2/c1-35-25-10-12-33(28(34)18-25)24-7-5-23(6-8-24)32-15-13-31(14-16-32)11-2-3-22-20-30-27-9-4-21(19-29)17-26(22)27/h4-10,12,17-18,20,30H,2-3,11,13-16H2,1H3
US Patent
n/an/a 1.80n/an/an/an/a7.4n/a
SUNSHINE LAKE PHARMA CO., LTD.
US Patent
Assay Description
The synaptosomes (150 μg) prepared from a rat brain were incubated at 37° C. for 15 minutes with 0.1 μCi [3H]5-HT in the absence or presenc...
US Patent US9714232 (2017)
BindingDB Entry DOI: 10.7270/Q28054N5