BDBM264119 3-(3-(4-(4-(5-oxo-1,6-naphthyridin-6(5H)-yl)phenyl)piperazin-1-yl)propyl)-1H-indole-5-carbonitrile::US9714232, 32
SMILES: O=c1n(ccc2ncccc12)-c1ccc(cc1)N1CCN(CCCc2c[nH]c3ccc(cc23)C#N)CC1
InChI Key: InChIKey=QGUBOPJCHFVENQ-UHFFFAOYSA-N
Data: 1 KI  6 IC50
Activity Spreadsheet -- Enzyme Inhibition Constant Data from BindingDB
Found 7 hits for monomerid = 264119
Trg + Lig
Ki
nM
ΔG°
kcal/mole
IC50
nM
Kd
nM
EC50/IC50
nM
koff
s-1
kon
M-1s-1
pHTemp
°C
5-hydroxytryptamine receptor 1A
(Homo sapiens (Human))
BDBM264119
(3-(3-(4-(4-(5-oxo-1,6-naphthyridin-6(5H)-yl)phenyl...)
Show SMILES O=c1n(ccc2ncccc12)-c1ccc(cc1)N1CCN(CCCc2c[nH]c3ccc(cc23)C#N)CC1
Show InChI InChI=1S/C30H28N6O/c31-20-22-5-10-28-27(19-22)23(21-33-28)3-2-13-34-15-17-35(18-16-34)24-6-8-25(9-7-24)36-14-11-29-26(30(36)37)4-1-12-32-29/h1,4-12,14,19,21,33H,2-3,13,15-18H2
US Patent
1.70n/an/an/an/an/an/a7.4n/a
SUNSHINE LAKE PHARMA CO., LTD.
US Patent
Assay Description
Human HEK-293 cell homogenates (36 μg protein) were incubated at 22° C. for 60 minutes with 0.3 nM [3H]8-0H-DPAT (Perkin-Elmer) in the absence o...
US Patent US9714232 (2017)
BindingDB Entry DOI: 10.7270/Q28054N5
Sodium-dependent serotonin transporter
(Rattus norvegicus (rat))
BDBM264119
(3-(3-(4-(4-(5-oxo-1,6-naphthyridin-6(5H)-yl)phenyl...)
Show SMILES O=c1n(ccc2ncccc12)-c1ccc(cc1)N1CCN(CCCc2c[nH]c3ccc(cc23)C#N)CC1
Show InChI InChI=1S/C30H28N6O/c31-20-22-5-10-28-27(19-22)23(21-33-28)3-2-13-34-15-17-35(18-16-34)24-6-8-25(9-7-24)36-14-11-29-26(30(36)37)4-1-12-32-29/h1,4-12,14,19,21,33H,2-3,13,15-18H2
n/an/a 0.930n/an/an/an/an/an/a
TBA
Citation and Details
5-hydroxytryptamine receptor 3A
(Homo sapiens (Human))
BDBM264119
(3-(3-(4-(4-(5-oxo-1,6-naphthyridin-6(5H)-yl)phenyl...)
Show SMILES O=c1n(ccc2ncccc12)-c1ccc(cc1)N1CCN(CCCc2c[nH]c3ccc(cc23)C#N)CC1
Show InChI InChI=1S/C30H28N6O/c31-20-22-5-10-28-27(19-22)23(21-33-28)3-2-13-34-15-17-35(18-16-34)24-6-8-25(9-7-24)36-14-11-29-26(30(36)37)4-1-12-32-29/h1,4-12,14,19,21,33H,2-3,13,15-18H2
Reactome pathway
n/an/a>1.00E+4n/an/an/an/an/an/a
TBA
Citation and Details
5-hydroxytryptamine receptor 2A
(Homo sapiens (Human))
BDBM264119
(3-(3-(4-(4-(5-oxo-1,6-naphthyridin-6(5H)-yl)phenyl...)
Show SMILES O=c1n(ccc2ncccc12)-c1ccc(cc1)N1CCN(CCCc2c[nH]c3ccc(cc23)C#N)CC1
Show InChI InChI=1S/C30H28N6O/c31-20-22-5-10-28-27(19-22)23(21-33-28)3-2-13-34-15-17-35(18-16-34)24-6-8-25(9-7-24)36-14-11-29-26(30(36)37)4-1-12-32-29/h1,4-12,14,19,21,33H,2-3,13,15-18H2
Reactome pathway
n/an/a>1.00E+4n/an/an/an/an/an/a
TBA
Citation and Details
5-hydroxytryptamine receptor 2C
(Homo sapiens)
BDBM264119
(3-(3-(4-(4-(5-oxo-1,6-naphthyridin-6(5H)-yl)phenyl...)
Show SMILES O=c1n(ccc2ncccc12)-c1ccc(cc1)N1CCN(CCCc2c[nH]c3ccc(cc23)C#N)CC1
Show InChI InChI=1S/C30H28N6O/c31-20-22-5-10-28-27(19-22)23(21-33-28)3-2-13-34-15-17-35(18-16-34)24-6-8-25(9-7-24)36-14-11-29-26(30(36)37)4-1-12-32-29/h1,4-12,14,19,21,33H,2-3,13,15-18H2
n/an/a>1.00E+4n/an/an/an/an/an/a
TBA
Citation and Details
5-hydroxytryptamine receptor 1A
(Rattus norvegicus (rat))
BDBM264119
(3-(3-(4-(4-(5-oxo-1,6-naphthyridin-6(5H)-yl)phenyl...)
Show SMILES O=c1n(ccc2ncccc12)-c1ccc(cc1)N1CCN(CCCc2c[nH]c3ccc(cc23)C#N)CC1
Show InChI InChI=1S/C30H28N6O/c31-20-22-5-10-28-27(19-22)23(21-33-28)3-2-13-34-15-17-35(18-16-34)24-6-8-25(9-7-24)36-14-11-29-26(30(36)37)4-1-12-32-29/h1,4-12,14,19,21,33H,2-3,13,15-18H2
US Patent
n/an/a 0.930n/an/an/an/a7.4n/a
SUNSHINE LAKE PHARMA CO., LTD.
US Patent
Assay Description
The synaptosomes (150 μg) prepared from a rat brain were incubated at 37° C. for 15 minutes with 0.1 μCi [3H]5-HT in the absence or presenc...
US Patent US9714232 (2017)
BindingDB Entry DOI: 10.7270/Q28054N5
5-hydroxytryptamine receptor 1A
(Homo sapiens (Human))
BDBM264119
(3-(3-(4-(4-(5-oxo-1,6-naphthyridin-6(5H)-yl)phenyl...)
Show SMILES O=c1n(ccc2ncccc12)-c1ccc(cc1)N1CCN(CCCc2c[nH]c3ccc(cc23)C#N)CC1
Show InChI InChI=1S/C30H28N6O/c31-20-22-5-10-28-27(19-22)23(21-33-28)3-2-13-34-15-17-35(18-16-34)24-6-8-25(9-7-24)36-14-11-29-26(30(36)37)4-1-12-32-29/h1,4-12,14,19,21,33H,2-3,13,15-18H2
n/an/a 1.70n/an/an/an/an/an/a
TBA
Citation and Details