null
SMILES: O=C1NCCCN1c1ccc(cc1)N1CCN(CCCCc2c[nH]c3ccc(cc23)C#N)CC1
InChI Key: InChIKey=HIYODESMTLBLLV-UHFFFAOYSA-N
Activity Spreadsheet -- Enzyme Inhibition Constant Data from BindingDB
Found 2 hits for monomerid = 264124
Trg + Lig
Ki
nM
ΔG°
kcal/mole
IC50
nM
Kd
nM
EC50/IC50
nM
koff
s-1
kon
M-1s-1
pHTemp
°C
5-hydroxytryptamine receptor 1A
(Homo sapiens (Human))
BDBM264124
(3-(4-(4-(4-(2-oxotetrahydropyrimidin-1(2H)-yl)phen...)
Show SMILES O=C1NCCCN1c1ccc(cc1)N1CCN(CCCCc2c[nH]c3ccc(cc23)C#N)CC1
Show InChI InChI=1S/C27H32N6O/c28-19-21-5-10-26-25(18-21)22(20-30-26)4-1-2-12-31-14-16-32(17-15-31)23-6-8-24(9-7-23)33-13-3-11-29-27(33)34/h5-10,18,20,30H,1-4,11-17H2,(H,29,34)
US Patent
1.30n/an/an/an/an/an/a7.4n/a
SUNSHINE LAKE PHARMA CO., LTD.
US Patent
Assay Description
Human HEK-293 cell homogenates (36 μg protein) were incubated at 22° C. for 60 minutes with 0.3 nM [3H]8-0H-DPAT (Perkin-Elmer) in the absence o...
US Patent US9714232 (2017)
BindingDB Entry DOI: 10.7270/Q28054N5
5-hydroxytryptamine receptor 1A
(Rattus norvegicus (rat))
BDBM264124
(3-(4-(4-(4-(2-oxotetrahydropyrimidin-1(2H)-yl)phen...)
Show SMILES O=C1NCCCN1c1ccc(cc1)N1CCN(CCCCc2c[nH]c3ccc(cc23)C#N)CC1
Show InChI InChI=1S/C27H32N6O/c28-19-21-5-10-26-25(18-21)22(20-30-26)4-1-2-12-31-14-16-32(17-15-31)23-6-8-24(9-7-23)33-13-3-11-29-27(33)34/h5-10,18,20,30H,1-4,11-17H2,(H,29,34)
US Patent
n/an/a 1.30n/an/an/an/a7.4n/a
SUNSHINE LAKE PHARMA CO., LTD.
US Patent
Assay Description
The synaptosomes (150 μg) prepared from a rat brain were incubated at 37° C. for 15 minutes with 0.1 μCi [3H]5-HT in the absence or presenc...
US Patent US9714232 (2017)
BindingDB Entry DOI: 10.7270/Q28054N5