BDBM26456 (2R)-2-({7-[(4-cyanophenyl)methoxy]naphthalene-2-}sulfonamido)pentanedioic acid::naphthalene-N-sulfonyl-D-glu derivative, 17o
SMILES: OC(=O)CC[C@@H](NS(=O)(=O)c1ccc2ccc(OCc3ccc(cc3)C#N)cc2c1)C(O)=O
InChI Key: InChIKey=DRAFRFXITJJMML-OAQYLSRUSA-N
Data: 1 IC50
PDB links: 1 PDB ID matches this monomer.
Activity Spreadsheet -- Enzyme Inhibition Constant Data from BindingDB
Found 1 hit for monomerid = 26456
Trg + Lig
Ki
nM
ΔG°
kcal/mole
IC50
nM
Kd
nM
EC50/IC50
nM
koff
s-1
kon
M-1s-1
pHTemp
°C
UDP-N-acetylmuramoylalanine--D-glutamate ligase
(Escherichia coli (strain K12))
BDBM26456
((2R)-2-({7-[(4-cyanophenyl)methoxy]naphthalene-2-}...)
Show SMILES OC(=O)CC[C@@H](NS(=O)(=O)c1ccc2ccc(OCc3ccc(cc3)C#N)cc2c1)C(O)=O |r|
Show InChI InChI=1S/C23H20N2O7S/c24-13-15-1-3-16(4-2-15)14-32-19-7-5-17-6-8-20(12-18(17)11-19)33(30,31)25-21(23(28)29)9-10-22(26)27/h1-8,11-12,21,25H,9-10,14H2,(H,26,27)(H,28,29)/t21-/m1/s1
n/an/a 1.22E+5n/an/an/an/a8.637
Lek Pharmaceuticals d.d.
Assay Description
The compounds were tested for their ability to inhibit the addition of D-[14C]Glu to UMA. The radioactive substrate and product were separated by re...
J Med Chem 51: 7486-94 (2008)
Article DOI: 10.1021/jm800762u
BindingDB Entry DOI: 10.7270/Q2B27SMN
3D
3D Structure (crystal)