BDBM26475 2-N,4-N-bis(3-bromophenyl)-5-fluoropyrimidine-2,4-diamine::pyrimidine, 1
SMILES: Fc1cnc(Nc2cccc(Br)c2)nc1Nc1cccc(Br)c1
InChI Key: InChIKey=JMFBVEWGVFCOKD-UHFFFAOYSA-N
Data: 1 IC50
Activity Spreadsheet -- Enzyme Inhibition Constant Data from BindingDB
Found 1 hit for monomerid = 26475
Trg + Lig
Ki
nM
ΔG°
kcal/mole
IC50
nM
Kd
nM
EC50/IC50
nM
koff
s-1
kon
M-1s-1
pHTemp
°C
Vascular endothelial growth factor receptor 2
(Homo sapiens (Human))
BDBM26475
(2-N,4-N-bis(3-bromophenyl)-5-fluoropyrimidine-2,4-...)
Show SMILES Fc1cnc(Nc2cccc(Br)c2)nc1Nc1cccc(Br)c1
Show InChI InChI=1S/C16H11Br2FN4/c17-10-3-1-5-12(7-10)21-15-14(19)9-20-16(23-15)22-13-6-2-4-11(18)8-13/h1-9H,(H2,20,21,22,23)
NCI pathway
Reactome pathway
n/an/a 400n/an/an/an/a7.522
GSK
Assay Description
The assay uses purified baculovirus-expressed GST-VEGFR2 interacting with biotinylated peptide substrates. HTRF is based on the proximity of europium...
J Med Chem 51: 4632-40 (2008)
Article DOI: 10.1021/jm800566m
BindingDB Entry DOI: 10.7270/Q26971XR