BDBM26484 N-{2-methyl-5-[(6-phenylpyrimidin-4-yl)amino]phenyl}methanesulfonamide::aminopyrimidine, 5
SMILES: Cc1ccc(Nc2cc(ncn2)-c2ccccc2)cc1NS(C)(=O)=O
InChI Key: InChIKey=CXQRKICWSCAUGW-UHFFFAOYSA-N
Data: 1 IC50
PDB links: 1 PDB ID matches this monomer.
Activity Spreadsheet -- Enzyme Inhibition Constant Data from BindingDB
Found 1 hit for monomerid = 26484
Trg + Lig
Ki
nM
ΔG°
kcal/mole
IC50
nM
Kd
nM
EC50/IC50
nM
koff
s-1
kon
M-1s-1
pHTemp
°C
Beta-secretase 1
(Homo sapiens (Human))
BDBM26484
(N-{2-methyl-5-[(6-phenylpyrimidin-4-yl)amino]pheny...)
Show SMILES Cc1ccc(Nc2cc(ncn2)-c2ccccc2)cc1NS(C)(=O)=O
Show InChI InChI=1S/C18H18N4O2S/c1-13-8-9-15(10-16(13)22-25(2,23)24)21-18-11-17(19-12-20-18)14-6-4-3-5-7-14/h3-12,22H,1-2H3,(H,19,20,21)
n/an/a 2.40E+4n/an/an/an/a4.522
Merck Research Laboratories
Assay Description
The assay was performed using a 96-well format on a HPLC equipped with four 96-well plate holders. After the reaction was terminated, the solution wa...
Bioorg Med Chem Lett 19: 17-20 (2009)
Article DOI: 10.1016/j.bmcl.2008.11.027
BindingDB Entry DOI: 10.7270/Q22J696F
3D
3D Structure (crystal)