BDBM26487 N-{2-bromo-5-[(6-phenylpyrimidin-4-yl)amino]phenyl}methanesulfonamide::aminopyrimidine, 8
SMILES: CS(=O)(=O)Nc1cc(Nc2cc(ncn2)-c2ccccc2)ccc1Br
InChI Key: InChIKey=JSYKRTSXODJXIS-UHFFFAOYSA-N
Data: 1 IC50
Activity Spreadsheet -- Enzyme Inhibition Constant Data from BindingDB
Found 1 hit for monomerid = 26487
Trg + Lig
Ki
nM
ΔG°
kcal/mole
IC50
nM
Kd
nM
EC50/IC50
nM
koff
s-1
kon
M-1s-1
pHTemp
°C
Beta-secretase 1
(Homo sapiens (Human))
BDBM26487
(N-{2-bromo-5-[(6-phenylpyrimidin-4-yl)amino]phenyl...)
Show SMILES CS(=O)(=O)Nc1cc(Nc2cc(ncn2)-c2ccccc2)ccc1Br
Show InChI InChI=1S/C17H15BrN4O2S/c1-25(23,24)22-16-9-13(7-8-14(16)18)21-17-10-15(19-11-20-17)12-5-3-2-4-6-12/h2-11,22H,1H3,(H,19,20,21)
n/an/a 3.00E+4n/an/an/an/a4.522
Merck Research Laboratories
Assay Description
The assay was performed using a 96-well format on a HPLC equipped with four 96-well plate holders. After the reaction was terminated, the solution wa...
Bioorg Med Chem Lett 19: 17-20 (2009)
Article DOI: 10.1016/j.bmcl.2008.11.027
BindingDB Entry DOI: 10.7270/Q22J696F