BDBM26490 N-{2-phenyl-5-[(6-phenylpyrimidin-4-yl)amino]phenyl}methanesulfonamide::aminopyrimidine, 11
SMILES: CS(=O)(=O)Nc1cc(Nc2cc(ncn2)-c2ccccc2)ccc1-c1ccccc1
InChI Key: InChIKey=IDHFMWCPFWHWHF-UHFFFAOYSA-N
Data: 1 IC50
Activity Spreadsheet -- Enzyme Inhibition Constant Data from BindingDB
Found 1 hit for monomerid = 26490
Trg + Lig
Ki
nM
ΔG°
kcal/mole
IC50
nM
Kd
nM
EC50/IC50
nM
koff
s-1
kon
M-1s-1
pHTemp
°C
Beta-secretase 1
(Homo sapiens (Human))
BDBM26490
(N-{2-phenyl-5-[(6-phenylpyrimidin-4-yl)amino]pheny...)
Show SMILES CS(=O)(=O)Nc1cc(Nc2cc(ncn2)-c2ccccc2)ccc1-c1ccccc1
Show InChI InChI=1S/C23H20N4O2S/c1-30(28,29)27-22-14-19(12-13-20(22)17-8-4-2-5-9-17)26-23-15-21(24-16-25-23)18-10-6-3-7-11-18/h2-16,27H,1H3,(H,24,25,26)
n/an/a>6.00E+5n/an/an/an/a4.522
Merck Research Laboratories
Assay Description
The assay was performed using a 96-well format on a HPLC equipped with four 96-well plate holders. After the reaction was terminated, the solution wa...
Bioorg Med Chem Lett 19: 17-20 (2009)
Article DOI: 10.1016/j.bmcl.2008.11.027
BindingDB Entry DOI: 10.7270/Q22J696F