BDBM26492 N-(4-bromo-3-nitrophenyl)-6-phenylpyrimidin-4-amine::aminopyrimidine, 13
SMILES: [O-][N+](=O)c1cc(Nc2cc(ncn2)-c2ccccc2)ccc1Br
InChI Key: InChIKey=LEBJQWAVNREOIG-UHFFFAOYSA-N
Data: 1 IC50
Activity Spreadsheet -- Enzyme Inhibition Constant Data from BindingDB
Found 1 hit for monomerid = 26492
Trg + Lig
Ki
nM
ΔG°
kcal/mole
IC50
nM
Kd
nM
EC50/IC50
nM
koff
s-1
kon
M-1s-1
pHTemp
°C
Beta-secretase 1
(Homo sapiens (Human))
BDBM26492
(N-(4-bromo-3-nitrophenyl)-6-phenylpyrimidin-4-amin...)
Show SMILES [O-][N+](=O)c1cc(Nc2cc(ncn2)-c2ccccc2)ccc1Br
Show InChI InChI=1S/C16H11BrN4O2/c17-13-7-6-12(8-15(13)21(22)23)20-16-9-14(18-10-19-16)11-4-2-1-3-5-11/h1-10H,(H,18,19,20)
n/an/a>6.00E+5n/an/an/an/a4.522
Merck Research Laboratories
Assay Description
The assay was performed using a 96-well format on a HPLC equipped with four 96-well plate holders. After the reaction was terminated, the solution wa...
Bioorg Med Chem Lett 19: 17-20 (2009)
Article DOI: 10.1016/j.bmcl.2008.11.027
BindingDB Entry DOI: 10.7270/Q22J696F