BDBM26542 1-{[4-(but-2-yn-1-yloxy)benzene]sulfonyl}azetidine-3-thiol::thiol-arylsulfonamide, 4a
SMILES: CC#CCOc1ccc(cc1)S(=O)(=O)N1CC(S)C1
InChI Key: InChIKey=DDWORVNNZSFIOY-UHFFFAOYSA-N
Data: 1 KI
Activity Spreadsheet -- Enzyme Inhibition Constant Data from BindingDB
Found 1 hit for monomerid = 26542
Trg + Lig
Ki
nM
ΔG°
kcal/mole
IC50
nM
Kd
nM
EC50/IC50
nM
koff
s-1
kon
M-1s-1
pHTemp
°C
Disintegrin and metalloproteinase domain-containing protein 17 [215-477,S266A,N452Q]
(Homo sapiens (Human))
BDBM26542
(1-{[4-(but-2-yn-1-yloxy)benzene]sulfonyl}azetidine...)
Show SMILES CC#CCOc1ccc(cc1)S(=O)(=O)N1CC(S)C1
Show InChI InChI=1S/C13H15NO3S2/c1-2-3-8-17-11-4-6-13(7-5-11)19(15,16)14-9-12(18)10-14/h4-7,12,18H,8-10H2,1H3
13 -10.6n/an/an/an/an/a7.522
Vertex Pharmaceuticals
Assay Description
The compounds were tested for TACE inhibition using fluorescence resonance energy transfer (FRET) assay. TACE catalyzed cleavage of the substrate pep...
Bioorg Med Chem Lett 17: 2250-3 (2007)
Article DOI: 10.1016/j.bmcl.2007.01.064
BindingDB Entry DOI: 10.7270/Q2DV1H67
3D
3D Structure (docked)