BDBM26555 2-{[4-(but-2-yn-1-ylamino)benzene]sulfonyl}ethane-1-thiol::thiol-aryl sulfone, 13
SMILES: CC#CCNc1ccc(cc1)S(=O)(=O)CCS
InChI Key: InChIKey=LRESJQHCTORZKX-UHFFFAOYSA-N
Data: 1 KI
Activity Spreadsheet -- Enzyme Inhibition Constant Data from BindingDB
Found 1 hit for monomerid = 26555
Trg + Lig
Ki
nM
ΔG°
kcal/mole
IC50
nM
Kd
nM
EC50/IC50
nM
koff
s-1
kon
M-1s-1
pHTemp
°C
TNF-alpha-Converting Enzyme
(Homo sapiens (Human))
BDBM26555
(2-{[4-(but-2-yn-1-ylamino)benzene]sulfonyl}ethane-...)
Show SMILES CC#CCNc1ccc(cc1)S(=O)(=O)CCS
Show InChI InChI=1S/C12H15NO2S2/c1-2-3-8-13-11-4-6-12(7-5-11)17(14,15)10-9-16/h4-7,13,16H,8-10H2,1H3
2 -11.7n/an/an/an/an/a7.522
Vertex Pharmaceuticals
Assay Description
The compounds were tested for TACE inhibition using fluorescence resonance energy transfer (FRET) assay. TACE catalyzed cleavage of the substrate pep...
Bioorg Med Chem Lett 18: 44-8 (2008)
Article DOI: 10.1016/j.bmcl.2007.11.014
BindingDB Entry DOI: 10.7270/Q2930RH8