BDBM265587 US9718790, I-1205
SMILES: CCOC(=O)CCn1c(=O)[nH]\c(=N/c2ccc(Oc3ccncc3)cc2)n(Cc2ccc(Cl)cc2)c1=O
InChI Key: InChIKey=DDQSCQBHXAHRRJ-UHFFFAOYSA-N
Data: 1 IC50
Activity Spreadsheet -- Enzyme Inhibition Constant Data from BindingDB
Found 1 hit for monomerid = 265587
Trg + Lig
Ki
nM
ΔG°
kcal/mole
IC50
nM
Kd
nM
EC50/IC50
nM
koff
s-1
kon
M-1s-1
pHTemp
°C
P2X purinoceptor 3
(Homo sapiens (Human))
BDBM265587
(US9718790, I-1205)
Show SMILES CCOC(=O)CCn1c(=O)[nH]\c(=N/c2ccc(Oc3ccncc3)cc2)n(Cc2ccc(Cl)cc2)c1=O
Show InChI InChI=1S/C26H24ClN5O5/c1-2-36-23(33)13-16-31-25(34)30-24(32(26(31)35)17-18-3-5-19(27)6-4-18)29-20-7-9-21(10-8-20)37-22-11-14-28-15-12-22/h3-12,14-15H,2,13,16-17H2,1H3,(H,29,30,34)
US Patent
n/an/a 2n/an/an/an/a7.5n/a
SHIONOGI & CO., LTD.
US Patent
Assay Description
Stably expressing cell line (C6BU-1 transfected with human P2X3 receptor gene (GenBank accession number Y07683) was used. The cells were seeded in a ...
US Patent US9718790 (2017)
BindingDB Entry DOI: 10.7270/Q22809KB