BDBM26559 3-{[4-(but-2-yn-1-ylamino)benzene]sulfonyl}cyclohexane-1-thiol::thiol-aryl sulfone, 25
SMILES: CC#CCNc1ccc(cc1)S(=O)(=O)C1CCCC(S)C1
InChI Key: InChIKey=HVQVSRYAFQSVJD-UHFFFAOYSA-N
Data: 1 KI
Activity Spreadsheet -- Enzyme Inhibition Constant Data from BindingDB
Found 1 hit for monomerid = 26559
Trg + Lig
Ki
nM
ΔG°
kcal/mole
IC50
nM
Kd
nM
EC50/IC50
nM
koff
s-1
kon
M-1s-1
pHTemp
°C
TNF-alpha-Converting Enzyme
(Homo sapiens (Human))
BDBM26559
(3-{[4-(but-2-yn-1-ylamino)benzene]sulfonyl}cyclohe...)
Show SMILES CC#CCNc1ccc(cc1)S(=O)(=O)C1CCCC(S)C1
Show InChI InChI=1S/C16H21NO2S2/c1-2-3-11-17-13-7-9-15(10-8-13)21(18,19)16-6-4-5-14(20)12-16/h7-10,14,16-17,20H,4-6,11-12H2,1H3
17 -10.5n/an/an/an/an/a7.522
Vertex Pharmaceuticals
Assay Description
The compounds were tested for TACE inhibition using fluorescence resonance energy transfer (FRET) assay. TACE catalyzed cleavage of the substrate pep...
Bioorg Med Chem Lett 18: 44-8 (2008)
Article DOI: 10.1016/j.bmcl.2007.11.014
BindingDB Entry DOI: 10.7270/Q2930RH8